{"text_format":"1","workbook":"xlsx","n_sheets":6,"sheets":["Base","BL","Исходные данные","SS2","Спец. на лист","Спец. обор. изд. и мат."],"not_rendered":{"charts":0,"images":2,"macros":1,"external_links":0,"defined_names":1,"comments":1,"pivot_tables":4},"unopened":[],"bounds":{"document_bytes":16777216,"sheet_cells":100000,"rows_first":2000,"rows_last":500,"rows_between":2000,"halvings":0,"cell_chars":16384,"cell_head_chars":4096},"cells_cut":0,"cells_raw":0,"read":"whole","date_system":"1900"}

{"sheet":"Base","index":0,"n_rows":109,"n_cols":10,"rows_kept":109,"cut":false,"hidden":true,"merged":[]}
["Тип","Артикул","Наименование","Ед.изм.","Масса","Примечание","№ п/п","Кратн.","Снят","OboBettermann"]
["KSR20020",6249842,"Кольцо для защиты кромок LKM 20x20 мм, серый","шт.",8.9999999999999993E-3,"   ",8,1,"Нет"]
["KSR20030",6249844,"Кольцо для защиты кромок LKM 20x30 мм, серый","шт.",1.0999999999999999E-2,"   ",8,1,"Нет"]
["KSR30030",6249847,"Кольцо для защиты кромок LKM 30x30 мм, серый","шт.",1.2999999999999999E-2,"   ",8,1,"Нет"]
["KSR40040",6249846,"Кольцо для защиты кромок LKM 40x40 мм, серый","шт.",1.7999999999999999E-2,"   ",8,1,"Нет"]
["KSR40060",6249848,"Кольцо для защиты кромок LKM 40x60 мм, серый","шт.",2.3E-2,"   ",8,1,"Нет"]
["KSR60060",6249850,"Кольцо для защиты кромок LKM 60x60 мм, серый","шт.",2.4E-2,"   ",8,1,"Нет"]
["KSR60100",6249852,"Кольцо для защиты кромок LKM 60x100 мм, серый","шт.",3.4000000000000002E-2,"   ",8,1,"Нет"]
["KSR60150",6249854,"Кольцо для защиты кромок LKM 60x150 мм, серый","шт.",4.3999999999999997E-2,"   ",8,1,"Нет"]
["KSR60200",6249856,"Кольцо для защиты кромок LKM 60x200 мм, серый","шт.",4.7E-2,"   ",8,1,"Нет"]
["KSR80080",6249865,"Кольцо для защиты кромок LKM 80x80 мм, серый","шт.",3.7999999999999999E-2,"   ",8,1,"Нет"]
["LKM A40040FS",6247563,"Угол внешний кабель-канала LKM 40x40 мм, сталь оцинкованная","шт.",0.38600000000000001,"   ",4,1,"Нет"]
["LKM A40040RW",6249086,"Угол внешний кабель-канала LKM 40x40 мм, сталь белый","шт.",0.38600000000000001,"   ",4,1,"Нет"]
["LKM A40060FS",6247571,"Угол внешний кабель-канала LKM 40x60 мм, сталь оцинкованная","шт.",0.46300000000000002,"   ",4,1,"Нет"]
["LKM A40060RW",6249094,"Угол внешний кабель-канала LKM 40x60 мм, сталь белый","шт.",0.46300000000000002,"   ",4,1,"Нет"]
["LKM A60060FS",6248047,"Угол внешний кабель-канала LKM 60x60 мм, сталь оцинкованная","шт.",0.55800000000000005,"   ",4,1,"Нет"]
["LKM A60060RW",6249558,"Угол внешний кабель-канала LKM 60x60 мм, сталь белый","шт.",0.55800000000000005,"   ",4,1,"Нет"]
["LKM A60100FS",6248063,"Угол внешний кабель-канала LKM 60x100 мм, сталь оцинкованная","шт.",0.73099999999999998,"   ",4,1,"Нет"]
["LKM A60100RW",6249574,"Угол внешний кабель-канала LKM 60x100 мм, сталь белый","шт.",0.73099999999999998,"   ",4,1,"Нет"]
["LKM A60150FS",6248071,"Угол внешний кабель-канала LKM 60x150 мм, сталь оцинкованная","шт.",0.91300000000000003,"   ",4,1,"Нет"]
["LKM A60150RW",6249582,"Угол внешний кабель-канала LKM 60x150 мм, сталь белый","шт.",0.91300000000000003,"   ",4,1,"Нет"]
["LKM A60200FS",6248098,"Угол внешний кабель-канала LKM 60x200 мм, сталь оцинкованная","шт.",1.1399999999999999,"   ",4,1,"Нет"]
["LKM A60200RW",6249590,"Угол внешний кабель-канала LKM 60x200 мм, сталь белый","шт.",1.1399999999999999,"   ",4,1,"Нет"]
["LKM A80080FS",6248332,"Угол внешний кабель-канала LKM 80x80 мм, сталь оцинкованная","шт.",0.753,"   ",4,1,"Нет"]
["LKM A80080RW",6248432,"Угол внешний кабель-канала LKM 80x80 мм, сталь белый","шт.",0.753,"   ",4,1,"Нет"]
["LKM E40040FS",6247881,"Заглушка кабель-канала LKM 40x40 мм, сталь оцинкованная","шт.",2.5000000000000001E-2,"   ",7,1,"Нет"]
["LKM E40040RW",6249418,"Заглушка кабель-канала LKM 40x40 мм, сталь белый","шт.",2.5000000000000001E-2,"   ",7,1,"Нет"]
["LKM E40060FS",6247903,"Заглушка кабель-канала LKM 40x60 мм, сталь оцинкованная","шт.",0.03,"   ",7,1,"Нет"]
["LKM E40060RW",6249426,"Заглушка кабель-канала LKM 40x60 мм, сталь белый","шт.",0.03,"   ",7,1,"Нет"]
["LKM E60060FS",6248284,"Заглушка кабель-канала LKM 60x60 мм, сталь оцинкованная","шт.",4.4999999999999998E-2,"   ",7,1,"Нет"]
["LKM E60060RW",6249795,"Заглушка кабель-канала LKM 60x60 мм, сталь белый","шт.",4.4999999999999998E-2,"   ",7,1,"Нет"]
["LKM E60100FS",6248306,"Заглушка кабель-канала LKM 60x100 мм, сталь оцинкованная","шт.",6.2E-2,"   ",7,1,"Нет"]
["LKM E60100RW",6249817,"Заглушка кабель-канала LKM 60x100 мм, сталь белый","шт.",6.5000000000000002E-2,"   ",7,1,"Нет"]
["LKM E60150FS",6248314,"Заглушка кабель-канала LKM 60x150 мм, сталь оцинкованная","шт.",8.4000000000000005E-2,"   ",7,1,"Нет"]
["LKM E60150RW",6249825,"Заглушка кабель-канала LKM 60x150 мм, сталь белый","шт.",0.09,"   ",7,1,"Нет"]
["LKM E60200FS",6248322,"Заглушка кабель-канала LKM 60x200 мм, сталь оцинкованная","шт.",0.108,"   ",7,1,"Нет"]
["LKM E60200RW",6249833,"Заглушка кабель-канала LKM 60x200 мм, сталь белый","шт.",0.115,"   ",7,1,"Нет"]
["LKM E80080FS",6248344,"Заглушка кабель-канала LKM 80x80 мм, сталь оцинкованная","шт.",7.0000000000000007E-2,"   ",7,1,"Нет"]
["LKM E80080RW",6248454,"Заглушка кабель-канала LKM 80x80 мм, сталь белый","шт.",7.0000000000000007E-2,"   ",7,1,"Нет"]
["LKM F40040FS",6247490,"Угол плоский с крышкой кабель-канала LKM 40x40 мм, сталь оцинкованная","шт.",0.371,"   ",6,1,"Нет"]
["LKM F40040RW",6248993,"Угол плоский с крышкой кабель-канала LKM 40x40 мм, сталь белый","шт.",0.371,"   ",6,1,"Нет"]
["LKM F40060FS",6247504,"Угол плоский с крышкой кабель-канала LKM 40x60 мм, сталь оцинкованная","шт.",0.47399999999999998,"   ",6,1,"Нет"]
["LKM F40060RW",6249000,"Угол плоский с крышкой кабель-канала LKM 40x60 мм, сталь белый","шт.",0.47399999999999998,"   ",6,1,"Нет"]
["LKM F60060FS",6247989,"Угол плоский с крышкой кабель-канала LKM 60x60 мм, сталь оцинкованная","шт.",0.54700000000000004,"   ",6,1,"Нет"]
["LKM F60060RW",6249485,"Угол плоский с крышкой кабель-канала LKM 60x60 мм, сталь белый","шт.",0.54700000000000004,"   ",6,1,"Нет"]
["LKM F60100FS",6248004,"Угол плоский с крышкой кабель-канала LKM 60x100 мм, сталь оцинкованная","шт.",0.63400000000000001,"   ",6,1,"Нет"]
["LKM F60100RW",6249507,"Угол плоский с крышкой кабель-канала LKM 60x100 мм, сталь белый","шт.",0.63400000000000001,"   ",6,1,"Нет"]
["LKM F60150FS",6248012,"Угол плоский с крышкой кабель-канала LKM 60x150 мм, сталь оцинкованная","шт.",1.135,"   ",6,1,"Нет"]
["LKM F60150RW",6249515,"Угол плоский с крышкой кабель-канала LKM 60x150 мм, сталь белый","шт.",1.135,"   ",6,1,"Нет"]
["LKM F60200FS",6248020,"Угол плоский с крышкой кабель-канала LKM 60x200 мм, сталь оцинкованная","шт.",1.544,"   ",6,1,"Нет"]
["LKM F60200RW",6249523,"Угол плоский с крышкой кабель-канала LKM 60x200 мм, сталь белый","шт.",1.544,"   ",6,1,"Нет"]
["LKM F80080FS",6248328,"Угол плоский с крышкой кабель-канала LKM 80x80 мм, сталь оцинкованная","шт.",0.8,"   ",6,1,"Нет"]
["LKM F80080RW",6248428,"Угол плоский с крышкой кабель-канала LKM 80x80 мм, сталь белый","шт.",0.8,"   ",6,1,"Нет"]
["LKM I40040FS",6247652,"Угол внутренний кабель-канала LKM 40x40 мм, сталь оцинкованная","шт.",0.28000000000000003,"   ",3,1,"Нет"]
["LKM I40040RW",6249167,"Угол внутренний кабель-канала LKM 40x40 мм, сталь белый","шт.",0.28000000000000003,"   ",3,1,"Нет"]
["LKM I40060FS",6247660,"Угол внутренний кабель-канала LKM 40x60 мм, сталь оцинкованная","шт.",0.314,"   ",3,1,"Нет"]
["LKM I40060RW",6249175,"Угол внутренний кабель-канала LKM 40x60 мм, сталь белый","шт.",0.314,"   ",3,1,"Нет"]
["LKM I60060FS",6248128,"Угол внутренний кабель-канала LKM 60x60 мм, сталь оцинкованная","шт.",0.31900000000000001,"   ",3,1,"Нет"]
["LKM I60060RW",6249612,"Угол внутренний кабель-канала LKM 60x60 мм, сталь белый","шт.",0.31900000000000001,"   ",3,1,"Нет"]
["LKM I60100FS",6248144,"Угол внутренний кабель-канала LKM 60x100 мм, сталь оцинкованная","шт.",0.39400000000000002,"   ",3,1,"Нет"]
["LKM I60100RW",6249639,"Угол внутренний кабель-канала LKM 60x100 мм, сталь белый","шт.",0.39400000000000002,"   ",3,1,"Нет"]
["LKM I60150FS",6248152,"Угол внутренний кабель-канала LKM 60x150 мм, сталь оцинкованная","шт.",0.48399999999999999,"   ",3,1,"Нет"]
["LKM I60150RW",6249647,"Угол внутренний кабель-канала LKM 60x150 мм, сталь белый","шт.",0.48399999999999999,"   ",3,1,"Нет"]
["LKM I60200FS",6248160,"Угол внутренний кабель-канала LKM 60x200 мм, сталь оцинкованная","шт.",0.57499999999999996,"   ",3,1,"Нет"]
["LKM I60200RW",6249655,"Угол внутренний кабель-канала LKM 60x200 мм, сталь белый","шт.",0.57499999999999996,"   ",3,1,"Нет"]
["LKM I80080FS",6248336,"Угол внутренний кабель-канала LKM 80x80 мм, сталь оцинкованная","шт.",0.38700000000000001,"   ",3,1,"Нет"]
["LKM I80080RW",6248436,"Угол внутренний кабель-канала LKM 80x80 мм, сталь белый","шт.",0.38700000000000001,"   ",3,1,"Нет"]
["LKM SV20",6247431,"Соединитель стыковой каналов LKM20020, нерж. сталь","шт.",1.9E-3,"   ",2,1,"Нет"]
["LKM SV30",6247434,"Соединитель стыковой каналов LKM20030, LKM30030, нерж. сталь","шт.",4.0000000000000001E-3,"   ",2,1,"Нет"]
["LKM SV40",6247458,"Соединитель стыковой каналов LKM40040, LKM40060, нерж. сталь","шт.",0.01,"   ",2,1,"Нет"]
["LKM SV60",6247466,"Соединитель стыковой каналов LKM60060, 60100, 60150, 60200, нерж. сталь","шт.",1.6E-2,"   ",2,1,"Нет"]
["LKM SV80",6247472,"Соединитель стыковой каналов LKM80080, нерж. сталь","шт.",1.2999999999999999E-2,"   ",2,1,"Нет"]
["LKM T40040FS",6247725,"Т-образная секция с крышкой для кабель-канала LKM 40x40 мм, сталь оцинкованная","шт.",0.39700000000000002,"   ",5,1,"Нет"]
["LKM T40040RW",6249256,"Т-образная секция с крышкой для кабель-канала LKM 40x40 мм, сталь белый","шт.",0.39700000000000002,"   ",5,1,"Нет"]
["LKM T40060FS",6247733,"Т-образная секция с крышкой для кабель-канала LKM 40x60 мм, сталь оцинкованная","шт.",0.46800000000000003,"   ",5,1,"Нет"]
["LKM T40060RW",6249264,"Т-образная секция с крышкой для кабель-канала LKM 40x60 мм, сталь белый","шт.",0.46800000000000003,"   ",5,1,"Нет"]
["LKM T60060FS",6248187,"Т-образная секция с крышкой для кабель-канала LKM 60x60 мм, сталь оцинкованная","шт.",0.54200000000000004,"   ",5,1,"Нет"]
["LKM T60060RW",6249671,"Т-образная секция с крышкой для кабель-канала LKM 60x60 мм, сталь белый","шт.",0.54200000000000004,"   ",5,1,"Нет"]
["LKM T60100FS",6248209,"Т-образная секция с крышкой для кабель-канала LKM 60x100 мм, сталь оцинкованная","шт.",0.69199999999999995,"   ",5,1,"Нет"]
["LKM T60100RW",6249701,"Т-образная секция с крышкой для кабель-канала LKM 60x100 мм, сталь белый","шт.",0.69199999999999995,"   ",5,1,"Нет"]
["LKM T60150FS",6248217,"Т-образная секция с крышкой для кабель-канала LKM 60x150 мм, сталь оцинкованная","шт.",0.876,"   ",5,1,"Нет"]
["LKM T60150RW",6249728,"Т-образная секция с крышкой для кабель-канала LKM 60x150 мм, сталь белый","шт.",0.876,"   ",5,1,"Нет"]
["LKM T60200FS",6248225,"Т-образная секция с крышкой для кабель-канала LKM 60x200 мм, сталь оцинкованная","шт.",1.06,"   ",5,1,"Нет"]
["LKM T60200RW",6249736,"Т-образная секция с крышкой для кабель-канала LKM 60x200 мм, сталь белый","шт.",1.06,"   ",5,1,"Нет"]
["LKM T80080FS",6248340,"Т-образная секция с крышкой для кабель-канала LKM 80x80 мм, сталь оцинкованная","шт.",0.67200000000000004,"   ",5,1,"Нет"]
["LKM T80080RW",6248450,"Т-образная секция с крышкой для кабель-канала LKM 80x80 мм, сталь белый","шт.",0.67200000000000004,"   ",5,1,"Нет"]
["LKM TWS55",6249876,"Перегородка разделительная кабель-канала LKM 55x2000 мм, сталь","м",0.53,"Ед.изм. - м",9,2,"Нет"]
["LKM TWS75",6249880,"Перегородка разделительная кабель-канала LKM 75x2000 мм, сталь","м",1.1399999999999999,"Ед.изм. - м",9,2,"Нет"]
["LKM20020FS",6246966,"Металлический кабель-канал LKM 20x20x2000 мм, сталь оцинкованная","м",0.46,"Ед.изм. - м",1,2,"Нет"]
["LKM20020RW",6248462,"Металлический кабель-канал LKM 20x20x2000 мм, сталь белый","м",0.52,"Ед.изм. - м",1,2,"Нет"]
["LKM20030FS",6246974,"Металлический кабель-канал LKM 20x30x2000 мм, сталь оцинкованная","м",0.57999999999999996,"Ед.изм. - м",1,2,"Нет"]
["LKM20030RW",6248470,"Металлический кабель-канал LKM 20x30x2000 мм, сталь белый","м",0.57999999999999996,"Ед.изм. - м",1,2,"Нет"]
["LKM30030FS",6246985,"Металлический кабель-канал LKM 30x30x2000 мм, сталь оцинкованная","м",1.07,"Ед.изм. - м",1,2,"Нет"]
["LKM30030RW",6248489,"Металлический кабель-канал LKM 30x30x2000 мм, сталь белый","м",1,"Ед.изм. - м",1,2,"Нет"]
["LKM40040FS",6246990,"Металлический кабель-канал LKM 40x40x2000 мм, сталь оцинкованная","м",1.17,"Ед.изм. - м",1,2,"Нет"]
["LKM40040RW",6248497,"Металлический кабель-канал LKM 40x40x2000 мм, сталь белый","м",1.276,"Ед.изм. - м",1,2,"Нет"]
["LKM40060FS",6247016,"Металлический кабель-канал LKM 40x60x2000 мм, сталь оцинкованная","м",1.512,"Ед.изм. - м",1,2,"Нет"]
["LKM40060RW",6248519,"Металлический кабель-канал LKM 40x60x2000 мм, сталь белый","м",1.512,"Ед.изм. - м",1,2,"Нет"]
["LKM60060FS",6247091,"Металлический кабель-канал LKM 60x60x2000 мм, сталь оцинкованная","м",1.7470000000000001,"Ед.изм. - м",1,2,"Нет"]
["LKM60060RW",6248608,"Металлический кабель-канал LKM 60x60x2000 мм, сталь белый","м",1.7470000000000001,"Ед.изм. - м",1,2,"Нет"]
["LKM60100FS",6247113,"Металлический кабель-канал LKM 60x100x2000 мм, сталь оцинкованная","м",2.2170000000000001,"Ед.изм. - м",1,2,"Нет"]
["LKM60100RW",6248624,"Металлический кабель-канал LKM 60x100x2000 мм, сталь белый","м",2.2170000000000001,"Ед.изм. - м",1,2,"Нет"]
["LKM60150FS",6247148,"Металлический кабель-канал LKM 60x150x2000 мм, сталь оцинкованная","м",2.8010000000000002,"Ед.изм. - м",1,2,"Нет"]
["LKM60150RW",6248640,"Металлический кабель-канал LKM 60x150x2000 мм, сталь белый","м",2.8010000000000002,"Ед.изм. - м",1,2,"Нет"]
["LKM60200FS",6247164,"Металлический кабель-канал LKM 60x200x2000 мм, сталь оцинкованная","м",3.387,"Ед.изм. - м",1,2,"Нет"]
["LKM60200RW",6248667,"Металлический кабель-канал LKM 60x200x2000 мм, сталь белый","м",3.387,"Ед.изм. - м",1,2,"Нет"]
["LKM80080FS",6247194,"Металлический кабель-канал LKM 80x80x2000 мм, сталь оцинкованная","м",2.15,"Ед.изм. - м",1,2,"Нет"]
["LKM80080RW",6248694,"Металлический кабель-канал LKM 80x80x2000 мм, сталь белый","м",2.38,"Ед.изм. - м",1,2,"Нет"]
["910 SD 6X40",2351064,"Дюбель 6x40 мм","шт.",5.5500000000000002E-3,"   ",10,1,"Нет"]

{"sheet":"BL","index":1,"n_rows":26,"n_cols":76,"rows_kept":26,"cut":false,"hidden":true,"merged":[[0,56,0,59],[0,40,0,43],[0,52,0,55],[0,64,0,67],[0,0,0,7],[0,72,0,75],[0,12,0,15],[0,24,0,27],[0,36,0,39],[0,48,0,51],[0,8,0,11],[0,68,0,71],[0,16,0,19],[0,28,0,31],[0,60,0,63],[0,20,0,23],[0,32,0,35],[0,44,0,47]]}
["Короб",null,null,null,null,null,null,null,"Стыковой соединитель",null,null,null,"Крепеж короба",null,null,null,"Внутренний угол",null,null,null,"Стык. соед. внутреннего угла",null,null,null,"Крепеж внутреннего угла",null,null,null,"Внешний угол",null,null,null,"Стык. соед. внешнего угла",null,null,null,"Крепеж внешнего угла",null,null,null,"Т-образная секция",null,null,null,"Стык. соед. Т-образной секции",null,null,null,"Крепеж Т-образной секции",null,null,null,"Плоский угол",null,null,null,"Стык. соед. плоского угла",null,null,null,"Крепеж плоского угла",null,null,null,"Заглушка",null,null,null,"Кольцо для защиты кромок",null,null,null,"Перегородка"]
["Тип","Артикул","Ед.изм.","Кол-во\nна 1 эл.","Сечение","Глубина\n(борт)","Высота\n(дно)","Цвет","Тип","Артикул","Ед.изм.","Кол-во\nна 1 эл.","Тип","Артикул","Ед.изм.","Кол-во\nна 1 эл.","Тип","Артикул","Ед.изм.","Кол-во\nна 1 эл.","Тип","Артикул","Ед.изм.","Кол-во\nна 1 эл.","Тип","Артикул","Ед.изм.","Кол-во\nна 1 эл.","Тип","Артикул","Ед.изм.","Кол-во\nна 1 эл.","Тип","Артикул","Ед.изм.","Кол-во\nна 1 эл.","Тип","Артикул","Ед.изм.","Кол-во\nна 1 эл.","Тип","Артикул","Ед.изм.","Кол-во\nна 1 эл.","Тип","Артикул","Ед.изм.","Кол-во\nна 1 эл.","Тип","Артикул","Ед.изм.","Кол-во\nна 1 эл.","Тип","Артикул","Ед.изм.","Кол-во\nна 1 эл.","Тип","Артикул","Ед.изм.","Кол-во\nна 1 эл.","Тип","Артикул","Ед.изм.","Кол-во\nна 1 эл.","Тип","Артикул","Ед.изм.","Кол-во\nна 1 эл.","Тип","Артикул","Ед.изм.","Кол-во\nна 1 эл.","Тип","Артикул","Ед.изм.","Кол-во\nна 1 эл."]
["---","---","---",null,"---","---","---","---","---","---","---","---","---","---","---","---","---","---","---","---","---","---","---","---","---","---","---","---","---","---","---","---","---","---","---","---","---","---","---","---","---","---","---","---","---","---","---","---","---","---","---","---","---","---","---","---","---","---","---","---","---","---","---","---","---","---","---","---","---","---","---","---","---","---","---","---"]
["LKM20020FS",{"$f":"VLOOKUP(A4,Base!$A:$I,2,FALSE)","v":6246966},{"$f":"VLOOKUP(A4,Base!$A:$I,4,FALSE)","v":"м"},2,"20х20",20,20,"Сталь",{"$f":"CONCATENATE(\"LKM SV\",$G4)","v":"LKM SV20"},{"$f":"VLOOKUP(I4,Base!$A:$I,2,FALSE)","v":6247431},{"$f":"VLOOKUP(I4,Base!$A:$I,4,FALSE)","v":"шт."},{"$f":"IF(F4<40,1,2)","v":1},"910 SD 6x40",{"$f":"VLOOKUP(M4,Base!$A:$I,2,FALSE)","v":2351064},{"$f":"VLOOKUP(M4,Base!$A:$I,4,FALSE)","v":"шт."},6,"---","---","---","---","---","---","---","---","---","---","---","---","---","---","---","---","---","---","---","---","---","---","---","---","---","---","---","---","---","---","---","---","---","---","---","---","---","---","---","---","---","---","---","---","---","---","---","---","---","---","---","---",{"$f":"CONCATENATE(\"KSR\",$F4,IF($G4<100,\"0\",\"\"),$G4)","v":"KSR20020"},{"$f":"VLOOKUP(BQ4,Base!$A:$I,2,FALSE)","v":6249842},{"$f":"VLOOKUP(BQ4,Base!$A:$I,4,FALSE)","v":"шт."},1,"---","---","---","---"]
["LKM20020RW",{"$f":"VLOOKUP(A5,Base!$A:$I,2,FALSE)","v":6248462},{"$f":"VLOOKUP(A5,Base!$A:$I,4,FALSE)","v":"м"},2,"20х20",20,20,"Белый","LKM SV20",{"$f":"VLOOKUP(I5,Base!$A:$I,2,FALSE)","v":6247431},{"$f":"VLOOKUP(I5,Base!$A:$I,4,FALSE)","v":"шт."},1,"910 SD 6x40",{"$f":"VLOOKUP(M5,Base!$A:$I,2,FALSE)","v":2351064},{"$f":"VLOOKUP(M5,Base!$A:$I,4,FALSE)","v":"шт."},6,"---","---","---","---","---","---","---","---","---","---","---","---","---","---","---","---","---","---","---","---","---","---","---","---","---","---","---","---","---","---","---","---","---","---","---","---","---","---","---","---","---","---","---","---","---","---","---","---","---","---","---","---","KSR20020",{"$f":"VLOOKUP(BQ5,Base!$A:$I,2,FALSE)","v":6249842},{"$f":"VLOOKUP(BQ5,Base!$A:$I,4,FALSE)","v":"шт."},1,"---","---","---","---"]
["LKM20030FS",{"$f":"VLOOKUP(A6,Base!$A:$I,2,FALSE)","v":6246974},{"$f":"VLOOKUP(A6,Base!$A:$I,4,FALSE)","v":"м"},2,"20х30",20,30,"Сталь","LKM SV30",{"$f":"VLOOKUP(I6,Base!$A:$I,2,FALSE)","v":6247434},{"$f":"VLOOKUP(I6,Base!$A:$I,4,FALSE)","v":"шт."},1,"910 SD 6x40",{"$f":"VLOOKUP(M6,Base!$A:$I,2,FALSE)","v":2351064},{"$f":"VLOOKUP(M6,Base!$A:$I,4,FALSE)","v":"шт."},6,"---","---","---","---","---","---","---","---","---","---","---","---","---","---","---","---","---","---","---","---","---","---","---","---","---","---","---","---","---","---","---","---","---","---","---","---","---","---","---","---","---","---","---","---","---","---","---","---","---","---","---","---","KSR20030",{"$f":"VLOOKUP(BQ6,Base!$A:$I,2,FALSE)","v":6249844},{"$f":"VLOOKUP(BQ6,Base!$A:$I,4,FALSE)","v":"шт."},1,"---","---","---","---"]
["LKM20030RW",{"$f":"VLOOKUP(A7,Base!$A:$I,2,FALSE)","v":6248470},{"$f":"VLOOKUP(A7,Base!$A:$I,4,FALSE)","v":"м"},2,"20х30",20,30,"Белый","LKM SV30",{"$f":"VLOOKUP(I7,Base!$A:$I,2,FALSE)","v":6247434},{"$f":"VLOOKUP(I7,Base!$A:$I,4,FALSE)","v":"шт."},1,"910 SD 6x40",{"$f":"VLOOKUP(M7,Base!$A:$I,2,FALSE)","v":2351064},{"$f":"VLOOKUP(M7,Base!$A:$I,4,FALSE)","v":"шт."},6,"---","---","---","---","---","---","---","---","---","---","---","---","---","---","---","---","---","---","---","---","---","---","---","---","---","---","---","---","---","---","---","---","---","---","---","---","---","---","---","---","---","---","---","---","---","---","---","---","---","---","---","---","KSR20030",{"$f":"VLOOKUP(BQ7,Base!$A:$I,2,FALSE)","v":6249844},{"$f":"VLOOKUP(BQ7,Base!$A:$I,4,FALSE)","v":"шт."},1,"---","---","---","---"]
["LKM30030FS",{"$f":"VLOOKUP(A8,Base!$A:$I,2,FALSE)","v":6246985},{"$f":"VLOOKUP(A8,Base!$A:$I,4,FALSE)","v":"м"},2,"30х30",30,30,"Сталь","LKM SV30",{"$f":"VLOOKUP(I8,Base!$A:$I,2,FALSE)","v":6247434},{"$f":"VLOOKUP(I8,Base!$A:$I,4,FALSE)","v":"шт."},1,"910 SD 6x40",{"$f":"VLOOKUP(M8,Base!$A:$I,2,FALSE)","v":2351064},{"$f":"VLOOKUP(M8,Base!$A:$I,4,FALSE)","v":"шт."},6,"---","---","---","---","---","---","---","---","---","---","---","---","---","---","---","---","---","---","---","---","---","---","---","---","---","---","---","---","---","---","---","---","---","---","---","---","---","---","---","---","---","---","---","---","---","---","---","---","---","---","---","---","KSR30030",{"$f":"VLOOKUP(BQ8,Base!$A:$I,2,FALSE)","v":6249847},{"$f":"VLOOKUP(BQ8,Base!$A:$I,4,FALSE)","v":"шт."},1,"---","---","---","---"]
["LKM30030RW",{"$f":"VLOOKUP(A9,Base!$A:$I,2,FALSE)","v":6248489},{"$f":"VLOOKUP(A9,Base!$A:$I,4,FALSE)","v":"м"},2,"30х30",30,30,"Белый","LKM SV30",{"$f":"VLOOKUP(I9,Base!$A:$I,2,FALSE)","v":6247434},{"$f":"VLOOKUP(I9,Base!$A:$I,4,FALSE)","v":"шт."},1,"910 SD 6x40",{"$f":"VLOOKUP(M9,Base!$A:$I,2,FALSE)","v":2351064},{"$f":"VLOOKUP(M9,Base!$A:$I,4,FALSE)","v":"шт."},6,"---","---","---","---","---","---","---","---","---","---","---","---","---","---","---","---","---","---","---","---","---","---","---","---","---","---","---","---","---","---","---","---","---","---","---","---","---","---","---","---","---","---","---","---","---","---","---","---","---","---","---","---","KSR30030",{"$f":"VLOOKUP(BQ9,Base!$A:$I,2,FALSE)","v":6249847},{"$f":"VLOOKUP(BQ9,Base!$A:$I,4,FALSE)","v":"шт."},1,"---","---","---","---"]
["LKM40040FS",{"$f":"VLOOKUP(A10,Base!$A:$I,2,FALSE)","v":6246990},{"$f":"VLOOKUP(A10,Base!$A:$I,4,FALSE)","v":"м"},2,"40х40",40,40,"Сталь",{"$f":"CONCATENATE(\"LKM SV\",$F10)","v":"LKM SV40"},{"$f":"VLOOKUP(I10,Base!$A:$I,2,FALSE)","v":6247458},{"$f":"VLOOKUP(I10,Base!$A:$I,4,FALSE)","v":"шт."},2,"910 SD 6x40",{"$f":"VLOOKUP(M10,Base!$A:$I,2,FALSE)","v":2351064},{"$f":"VLOOKUP(M10,Base!$A:$I,4,FALSE)","v":"шт."},6,{"$f":"CONCATENATE(\"LKM I\",$F10,IF($G10<100,\"0\",\"\"),$G10,IF(H10=\"Сталь\",\"FS\",\"RW\"))","v":"LKM I40040FS"},{"$f":"VLOOKUP(Q10,Base!$A:$I,2,FALSE)","v":6247652},{"$f":"VLOOKUP(Q10,Base!$A:$I,4,FALSE)","v":"шт."},1,{"$f":"CONCATENATE(\"LKM SV\",$F10)","v":"LKM SV40"},{"$f":"VLOOKUP(U10,Base!$A:$I,2,FALSE)","v":6247458},{"$f":"VLOOKUP(U10,Base!$A:$I,4,FALSE)","v":"шт."},4,"910 SD 6x40",{"$f":"VLOOKUP(Y10,Base!$A:$I,2,FALSE)","v":2351064},{"$f":"VLOOKUP(Y10,Base!$A:$I,4,FALSE)","v":"шт."},2,{"$f":"CONCATENATE(\"LKM A\",$F10,IF($G10<100,\"0\",\"\"),$G10,IF(I10=\"Сталь\",\"FS\",\"RW\"))","v":"LKM A40040RW"},{"$f":"VLOOKUP(AC10,Base!$A:$I,2,FALSE)","v":6249086},{"$f":"VLOOKUP(AC10,Base!$A:$I,4,FALSE)","v":"шт."},1,{"$f":"CONCATENATE(\"LKM SV\",$F10)","v":"LKM SV40"},{"$f":"VLOOKUP(AG10,Base!$A:$I,2,FALSE)","v":6247458},{"$f":"VLOOKUP(AG10,Base!$A:$I,4,FALSE)","v":"шт."},4,"910 SD 6x40",{"$f":"VLOOKUP(AK10,Base!$A:$I,2,FALSE)","v":2351064},{"$f":"VLOOKUP(AK10,Base!$A:$I,4,FALSE)","v":"шт."},2,{"$f":"CONCATENATE(\"LKM T\",$F10,IF($G10<100,\"0\",\"\"),$G10,IF(BQ10=\"Сталь\",\"FS\",\"RW\"))","v":"LKM T40040RW"},{"$f":"VLOOKUP(AO10,Base!$A:$I,2,FALSE)","v":6249256},{"$f":"VLOOKUP(AO10,Base!$A:$I,4,FALSE)","v":"шт."},1,{"$f":"CONCATENATE(\"LKM SV\",$F10)","v":"LKM SV40"},{"$f":"VLOOKUP(AS10,Base!$A:$I,2,FALSE)","v":6247458},{"$f":"VLOOKUP(AS10,Base!$A:$I,4,FALSE)","v":"шт."},6,"910 SD 6x40",{"$f":"VLOOKUP(AW10,Base!$A:$I,2,FALSE)","v":2351064},{"$f":"VLOOKUP(AW10,Base!$A:$I,4,FALSE)","v":"шт."},3,{"$f":"CONCATENATE(\"LKM F\",$F10,IF($G10<100,\"0\",\"\"),$G10,IF(Q10=\"Сталь\",\"FS\",\"RW\"))","v":"LKM F40040RW"},{"$f":"VLOOKUP(BA10,Base!$A:$I,2,FALSE)","v":6248993},{"$f":"VLOOKUP(BA10,Base!$A:$I,4,FALSE)","v":"шт."},1,{"$f":"CONCATENATE(\"LKM SV\",$F10)","v":"LKM SV40"},{"$f":"VLOOKUP(BE10,Base!$A:$I,2,FALSE)","v":6247458},{"$f":"VLOOKUP(BE10,Base!$A:$I,4,FALSE)","v":"шт."},4,"910 SD 6x40",{"$f":"VLOOKUP(BI10,Base!$A:$I,2,FALSE)","v":2351064},{"$f":"VLOOKUP(BI10,Base!$A:$I,4,FALSE)","v":"шт."},2,{"$f":"CONCATENATE(\"LKM E\",$F10,IF($G10<100,\"0\",\"\"),$G10,IF(AC10=\"Сталь\",\"FS\",\"RW\"))","v":"LKM E40040RW"},{"$f":"VLOOKUP(BM10,Base!$A:$I,2,FALSE)","v":6249418},{"$f":"VLOOKUP(BM10,Base!$A:$I,4,FALSE)","v":"шт."},1,"KSR40040",{"$f":"VLOOKUP(BQ10,Base!$A:$I,2,FALSE)","v":6249846},{"$f":"VLOOKUP(BQ10,Base!$A:$I,4,FALSE)","v":"шт."},1,"---","---","---","---"]
["LKM40040RW",{"$f":"VLOOKUP(A11,Base!$A:$I,2,FALSE)","v":6248497},{"$f":"VLOOKUP(A11,Base!$A:$I,4,FALSE)","v":"м"},2,"40х40",40,40,"Белый","LKM SV40",{"$f":"VLOOKUP(I11,Base!$A:$I,2,FALSE)","v":6247458},{"$f":"VLOOKUP(I11,Base!$A:$I,4,FALSE)","v":"шт."},2,"910 SD 6x40",{"$f":"VLOOKUP(M11,Base!$A:$I,2,FALSE)","v":2351064},{"$f":"VLOOKUP(M11,Base!$A:$I,4,FALSE)","v":"шт."},6,"LKM I40040RW",{"$f":"VLOOKUP(Q11,Base!$A:$I,2,FALSE)","v":6249167},{"$f":"VLOOKUP(Q11,Base!$A:$I,4,FALSE)","v":"шт."},1,"LKM SV40",{"$f":"VLOOKUP(U11,Base!$A:$I,2,FALSE)","v":6247458},{"$f":"VLOOKUP(U11,Base!$A:$I,4,FALSE)","v":"шт."},4,"910 SD 6x40",{"$f":"VLOOKUP(Y11,Base!$A:$I,2,FALSE)","v":2351064},{"$f":"VLOOKUP(Y11,Base!$A:$I,4,FALSE)","v":"шт."},2,"LKM A40040RW",{"$f":"VLOOKUP(AC11,Base!$A:$I,2,FALSE)","v":6249086},{"$f":"VLOOKUP(AC11,Base!$A:$I,4,FALSE)","v":"шт."},1,"LKM SV40",{"$f":"VLOOKUP(AG11,Base!$A:$I,2,FALSE)","v":6247458},{"$f":"VLOOKUP(AG11,Base!$A:$I,4,FALSE)","v":"шт."},4,"910 SD 6x40",{"$f":"VLOOKUP(AK11,Base!$A:$I,2,FALSE)","v":2351064},{"$f":"VLOOKUP(AK11,Base!$A:$I,4,FALSE)","v":"шт."},2,"LKM T40040RW",{"$f":"VLOOKUP(AO11,Base!$A:$I,2,FALSE)","v":6249256},{"$f":"VLOOKUP(AO11,Base!$A:$I,4,FALSE)","v":"шт."},1,"LKM SV40",{"$f":"VLOOKUP(AS11,Base!$A:$I,2,FALSE)","v":6247458},{"$f":"VLOOKUP(AS11,Base!$A:$I,4,FALSE)","v":"шт."},6,"910 SD 6x40",{"$f":"VLOOKUP(AW11,Base!$A:$I,2,FALSE)","v":2351064},{"$f":"VLOOKUP(AW11,Base!$A:$I,4,FALSE)","v":"шт."},3,"LKM F40040RW",{"$f":"VLOOKUP(BA11,Base!$A:$I,2,FALSE)","v":6248993},{"$f":"VLOOKUP(BA11,Base!$A:$I,4,FALSE)","v":"шт."},1,"LKM SV40",{"$f":"VLOOKUP(BE11,Base!$A:$I,2,FALSE)","v":6247458},{"$f":"VLOOKUP(BE11,Base!$A:$I,4,FALSE)","v":"шт."},4,"910 SD 6x40",{"$f":"VLOOKUP(BI11,Base!$A:$I,2,FALSE)","v":2351064},{"$f":"VLOOKUP(BI11,Base!$A:$I,4,FALSE)","v":"шт."},2,"LKM E40040RW",{"$f":"VLOOKUP(BM11,Base!$A:$I,2,FALSE)","v":6249418},{"$f":"VLOOKUP(BM11,Base!$A:$I,4,FALSE)","v":"шт."},1,"KSR40040",{"$f":"VLOOKUP(BQ11,Base!$A:$I,2,FALSE)","v":6249846},{"$f":"VLOOKUP(BQ11,Base!$A:$I,4,FALSE)","v":"шт."},1,"---","---","---","---"]
["LKM40060FS",{"$f":"VLOOKUP(A12,Base!$A:$I,2,FALSE)","v":6247016},{"$f":"VLOOKUP(A12,Base!$A:$I,4,FALSE)","v":"м"},2,"40х60",40,60,"Сталь","LKM SV40",{"$f":"VLOOKUP(I12,Base!$A:$I,2,FALSE)","v":6247458},{"$f":"VLOOKUP(I12,Base!$A:$I,4,FALSE)","v":"шт."},2,"910 SD 6x40",{"$f":"VLOOKUP(M12,Base!$A:$I,2,FALSE)","v":2351064},{"$f":"VLOOKUP(M12,Base!$A:$I,4,FALSE)","v":"шт."},6,"LKM I40060FS",{"$f":"VLOOKUP(Q12,Base!$A:$I,2,FALSE)","v":6247660},{"$f":"VLOOKUP(Q12,Base!$A:$I,4,FALSE)","v":"шт."},1,"LKM SV40",{"$f":"VLOOKUP(U12,Base!$A:$I,2,FALSE)","v":6247458},{"$f":"VLOOKUP(U12,Base!$A:$I,4,FALSE)","v":"шт."},4,"910 SD 6x40",{"$f":"VLOOKUP(Y12,Base!$A:$I,2,FALSE)","v":2351064},{"$f":"VLOOKUP(Y12,Base!$A:$I,4,FALSE)","v":"шт."},2,"LKM A40060RW",{"$f":"VLOOKUP(AC12,Base!$A:$I,2,FALSE)","v":6249094},{"$f":"VLOOKUP(AC12,Base!$A:$I,4,FALSE)","v":"шт."},1,"LKM SV40",{"$f":"VLOOKUP(AG12,Base!$A:$I,2,FALSE)","v":6247458},{"$f":"VLOOKUP(AG12,Base!$A:$I,4,FALSE)","v":"шт."},4,"910 SD 6x40",{"$f":"VLOOKUP(AK12,Base!$A:$I,2,FALSE)","v":2351064},{"$f":"VLOOKUP(AK12,Base!$A:$I,4,FALSE)","v":"шт."},2,"LKM T40060RW",{"$f":"VLOOKUP(AO12,Base!$A:$I,2,FALSE)","v":6249264},{"$f":"VLOOKUP(AO12,Base!$A:$I,4,FALSE)","v":"шт."},1,"LKM SV40",{"$f":"VLOOKUP(AS12,Base!$A:$I,2,FALSE)","v":6247458},{"$f":"VLOOKUP(AS12,Base!$A:$I,4,FALSE)","v":"шт."},6,"910 SD 6x40",{"$f":"VLOOKUP(AW12,Base!$A:$I,2,FALSE)","v":2351064},{"$f":"VLOOKUP(AW12,Base!$A:$I,4,FALSE)","v":"шт."},3,"LKM F40060RW",{"$f":"VLOOKUP(BA12,Base!$A:$I,2,FALSE)","v":6249000},{"$f":"VLOOKUP(BA12,Base!$A:$I,4,FALSE)","v":"шт."},1,"LKM SV40",{"$f":"VLOOKUP(BE12,Base!$A:$I,2,FALSE)","v":6247458},{"$f":"VLOOKUP(BE12,Base!$A:$I,4,FALSE)","v":"шт."},4,"910 SD 6x40",{"$f":"VLOOKUP(BI12,Base!$A:$I,2,FALSE)","v":2351064},{"$f":"VLOOKUP(BI12,Base!$A:$I,4,FALSE)","v":"шт."},2,"LKM E40060RW",{"$f":"VLOOKUP(BM12,Base!$A:$I,2,FALSE)","v":6249426},{"$f":"VLOOKUP(BM12,Base!$A:$I,4,FALSE)","v":"шт."},1,"KSR40060",{"$f":"VLOOKUP(BQ12,Base!$A:$I,2,FALSE)","v":6249848},{"$f":"VLOOKUP(BQ12,Base!$A:$I,4,FALSE)","v":"шт."},1,"---","---","---","---"]
["LKM40060RW",{"$f":"VLOOKUP(A13,Base!$A:$I,2,FALSE)","v":6248519},{"$f":"VLOOKUP(A13,Base!$A:$I,4,FALSE)","v":"м"},2,"40х60",40,60,"Белый","LKM SV40",{"$f":"VLOOKUP(I13,Base!$A:$I,2,FALSE)","v":6247458},{"$f":"VLOOKUP(I13,Base!$A:$I,4,FALSE)","v":"шт."},2,"910 SD 6x40",{"$f":"VLOOKUP(M13,Base!$A:$I,2,FALSE)","v":2351064},{"$f":"VLOOKUP(M13,Base!$A:$I,4,FALSE)","v":"шт."},6,"LKM I40060RW",{"$f":"VLOOKUP(Q13,Base!$A:$I,2,FALSE)","v":6249175},{"$f":"VLOOKUP(Q13,Base!$A:$I,4,FALSE)","v":"шт."},1,"LKM SV40",{"$f":"VLOOKUP(U13,Base!$A:$I,2,FALSE)","v":6247458},{"$f":"VLOOKUP(U13,Base!$A:$I,4,FALSE)","v":"шт."},4,"910 SD 6x40",{"$f":"VLOOKUP(Y13,Base!$A:$I,2,FALSE)","v":2351064},{"$f":"VLOOKUP(Y13,Base!$A:$I,4,FALSE)","v":"шт."},2,"LKM A40060RW",{"$f":"VLOOKUP(AC13,Base!$A:$I,2,FALSE)","v":6249094},{"$f":"VLOOKUP(AC13,Base!$A:$I,4,FALSE)","v":"шт."},1,"LKM SV40",{"$f":"VLOOKUP(AG13,Base!$A:$I,2,FALSE)","v":6247458},{"$f":"VLOOKUP(AG13,Base!$A:$I,4,FALSE)","v":"шт."},4,"910 SD 6x40",{"$f":"VLOOKUP(AK13,Base!$A:$I,2,FALSE)","v":2351064},{"$f":"VLOOKUP(AK13,Base!$A:$I,4,FALSE)","v":"шт."},2,"LKM T40060RW",{"$f":"VLOOKUP(AO13,Base!$A:$I,2,FALSE)","v":6249264},{"$f":"VLOOKUP(AO13,Base!$A:$I,4,FALSE)","v":"шт."},1,"LKM SV40",{"$f":"VLOOKUP(AS13,Base!$A:$I,2,FALSE)","v":6247458},{"$f":"VLOOKUP(AS13,Base!$A:$I,4,FALSE)","v":"шт."},6,"910 SD 6x40",{"$f":"VLOOKUP(AW13,Base!$A:$I,2,FALSE)","v":2351064},{"$f":"VLOOKUP(AW13,Base!$A:$I,4,FALSE)","v":"шт."},3,"LKM F40060RW",{"$f":"VLOOKUP(BA13,Base!$A:$I,2,FALSE)","v":6249000},{"$f":"VLOOKUP(BA13,Base!$A:$I,4,FALSE)","v":"шт."},1,"LKM SV40",{"$f":"VLOOKUP(BE13,Base!$A:$I,2,FALSE)","v":6247458},{"$f":"VLOOKUP(BE13,Base!$A:$I,4,FALSE)","v":"шт."},4,"910 SD 6x40",{"$f":"VLOOKUP(BI13,Base!$A:$I,2,FALSE)","v":2351064},{"$f":"VLOOKUP(BI13,Base!$A:$I,4,FALSE)","v":"шт."},2,"LKM E40060RW",{"$f":"VLOOKUP(BM13,Base!$A:$I,2,FALSE)","v":6249426},{"$f":"VLOOKUP(BM13,Base!$A:$I,4,FALSE)","v":"шт."},1,"KSR40060",{"$f":"VLOOKUP(BQ13,Base!$A:$I,2,FALSE)","v":6249848},{"$f":"VLOOKUP(BQ13,Base!$A:$I,4,FALSE)","v":"шт."},1,"---","---","---","---"]
["LKM60060FS",{"$f":"VLOOKUP(A14,Base!$A:$I,2,FALSE)","v":6247091},{"$f":"VLOOKUP(A14,Base!$A:$I,4,FALSE)","v":"м"},2,"60х60",60,60,"Сталь","LKM SV60",{"$f":"VLOOKUP(I14,Base!$A:$I,2,FALSE)","v":6247466},{"$f":"VLOOKUP(I14,Base!$A:$I,4,FALSE)","v":"шт."},2,"910 SD 6x40",{"$f":"VLOOKUP(M14,Base!$A:$I,2,FALSE)","v":2351064},{"$f":"VLOOKUP(M14,Base!$A:$I,4,FALSE)","v":"шт."},6,"LKM I60060FS",{"$f":"VLOOKUP(Q14,Base!$A:$I,2,FALSE)","v":6248128},{"$f":"VLOOKUP(Q14,Base!$A:$I,4,FALSE)","v":"шт."},1,"LKM SV60",{"$f":"VLOOKUP(U14,Base!$A:$I,2,FALSE)","v":6247466},{"$f":"VLOOKUP(U14,Base!$A:$I,4,FALSE)","v":"шт."},4,"910 SD 6x40",{"$f":"VLOOKUP(Y14,Base!$A:$I,2,FALSE)","v":2351064},{"$f":"VLOOKUP(Y14,Base!$A:$I,4,FALSE)","v":"шт."},2,"LKM A60060RW",{"$f":"VLOOKUP(AC14,Base!$A:$I,2,FALSE)","v":6249558},{"$f":"VLOOKUP(AC14,Base!$A:$I,4,FALSE)","v":"шт."},1,"LKM SV60",{"$f":"VLOOKUP(AG14,Base!$A:$I,2,FALSE)","v":6247466},{"$f":"VLOOKUP(AG14,Base!$A:$I,4,FALSE)","v":"шт."},4,"910 SD 6x40",{"$f":"VLOOKUP(AK14,Base!$A:$I,2,FALSE)","v":2351064},{"$f":"VLOOKUP(AK14,Base!$A:$I,4,FALSE)","v":"шт."},2,"LKM T60060RW",{"$f":"VLOOKUP(AO14,Base!$A:$I,2,FALSE)","v":6249671},{"$f":"VLOOKUP(AO14,Base!$A:$I,4,FALSE)","v":"шт."},1,"LKM SV60",{"$f":"VLOOKUP(AS14,Base!$A:$I,2,FALSE)","v":6247466},{"$f":"VLOOKUP(AS14,Base!$A:$I,4,FALSE)","v":"шт."},6,"910 SD 6x40",{"$f":"VLOOKUP(AW14,Base!$A:$I,2,FALSE)","v":2351064},{"$f":"VLOOKUP(AW14,Base!$A:$I,4,FALSE)","v":"шт."},3,"LKM F60060RW",{"$f":"VLOOKUP(BA14,Base!$A:$I,2,FALSE)","v":6249485},{"$f":"VLOOKUP(BA14,Base!$A:$I,4,FALSE)","v":"шт."},1,"LKM SV60",{"$f":"VLOOKUP(BE14,Base!$A:$I,2,FALSE)","v":6247466},{"$f":"VLOOKUP(BE14,Base!$A:$I,4,FALSE)","v":"шт."},4,"910 SD 6x40",{"$f":"VLOOKUP(BI14,Base!$A:$I,2,FALSE)","v":2351064},{"$f":"VLOOKUP(BI14,Base!$A:$I,4,FALSE)","v":"шт."},2,"LKM E60060RW",{"$f":"VLOOKUP(BM14,Base!$A:$I,2,FALSE)","v":6249795},{"$f":"VLOOKUP(BM14,Base!$A:$I,4,FALSE)","v":"шт."},1,"KSR60060",{"$f":"VLOOKUP(BQ14,Base!$A:$I,2,FALSE)","v":6249850},{"$f":"VLOOKUP(BQ14,Base!$A:$I,4,FALSE)","v":"шт."},1,{"$f":"CONCATENATE(\"LKM TWS\",$F14-5)","v":"LKM TWS55"},{"$f":"VLOOKUP(BU14,Base!$A:$I,2,FALSE)","v":6249876},{"$f":"VLOOKUP(BU14,Base!$A:$I,4,FALSE)","v":"м"},1]
["LKM60060RW",{"$f":"VLOOKUP(A15,Base!$A:$I,2,FALSE)","v":6248608},{"$f":"VLOOKUP(A15,Base!$A:$I,4,FALSE)","v":"м"},2,"60х60",60,60,"Белый","LKM SV60",{"$f":"VLOOKUP(I15,Base!$A:$I,2,FALSE)","v":6247466},{"$f":"VLOOKUP(I15,Base!$A:$I,4,FALSE)","v":"шт."},2,"910 SD 6x40",{"$f":"VLOOKUP(M15,Base!$A:$I,2,FALSE)","v":2351064},{"$f":"VLOOKUP(M15,Base!$A:$I,4,FALSE)","v":"шт."},6,"LKM I60060RW",{"$f":"VLOOKUP(Q15,Base!$A:$I,2,FALSE)","v":6249612},{"$f":"VLOOKUP(Q15,Base!$A:$I,4,FALSE)","v":"шт."},1,"LKM SV60",{"$f":"VLOOKUP(U15,Base!$A:$I,2,FALSE)","v":6247466},{"$f":"VLOOKUP(U15,Base!$A:$I,4,FALSE)","v":"шт."},4,"910 SD 6x40",{"$f":"VLOOKUP(Y15,Base!$A:$I,2,FALSE)","v":2351064},{"$f":"VLOOKUP(Y15,Base!$A:$I,4,FALSE)","v":"шт."},2,"LKM A60060RW",{"$f":"VLOOKUP(AC15,Base!$A:$I,2,FALSE)","v":6249558},{"$f":"VLOOKUP(AC15,Base!$A:$I,4,FALSE)","v":"шт."},1,"LKM SV60",{"$f":"VLOOKUP(AG15,Base!$A:$I,2,FALSE)","v":6247466},{"$f":"VLOOKUP(AG15,Base!$A:$I,4,FALSE)","v":"шт."},4,"910 SD 6x40",{"$f":"VLOOKUP(AK15,Base!$A:$I,2,FALSE)","v":2351064},{"$f":"VLOOKUP(AK15,Base!$A:$I,4,FALSE)","v":"шт."},2,"LKM T60060RW",{"$f":"VLOOKUP(AO15,Base!$A:$I,2,FALSE)","v":6249671},{"$f":"VLOOKUP(AO15,Base!$A:$I,4,FALSE)","v":"шт."},1,"LKM SV60",{"$f":"VLOOKUP(AS15,Base!$A:$I,2,FALSE)","v":6247466},{"$f":"VLOOKUP(AS15,Base!$A:$I,4,FALSE)","v":"шт."},6,"910 SD 6x40",{"$f":"VLOOKUP(AW15,Base!$A:$I,2,FALSE)","v":2351064},{"$f":"VLOOKUP(AW15,Base!$A:$I,4,FALSE)","v":"шт."},3,"LKM F60060RW",{"$f":"VLOOKUP(BA15,Base!$A:$I,2,FALSE)","v":6249485},{"$f":"VLOOKUP(BA15,Base!$A:$I,4,FALSE)","v":"шт."},1,"LKM SV60",{"$f":"VLOOKUP(BE15,Base!$A:$I,2,FALSE)","v":6247466},{"$f":"VLOOKUP(BE15,Base!$A:$I,4,FALSE)","v":"шт."},4,"910 SD 6x40",{"$f":"VLOOKUP(BI15,Base!$A:$I,2,FALSE)","v":2351064},{"$f":"VLOOKUP(BI15,Base!$A:$I,4,FALSE)","v":"шт."},2,"LKM E60060RW",{"$f":"VLOOKUP(BM15,Base!$A:$I,2,FALSE)","v":6249795},{"$f":"VLOOKUP(BM15,Base!$A:$I,4,FALSE)","v":"шт."},1,"KSR60060",{"$f":"VLOOKUP(BQ15,Base!$A:$I,2,FALSE)","v":6249850},{"$f":"VLOOKUP(BQ15,Base!$A:$I,4,FALSE)","v":"шт."},1,"LKM TWS55",{"$f":"VLOOKUP(BU15,Base!$A:$I,2,FALSE)","v":6249876},{"$f":"VLOOKUP(BU15,Base!$A:$I,4,FALSE)","v":"м"},1]
["LKM60100FS",{"$f":"VLOOKUP(A16,Base!$A:$I,2,FALSE)","v":6247113},{"$f":"VLOOKUP(A16,Base!$A:$I,4,FALSE)","v":"м"},2,"60х100",60,100,"Сталь","LKM SV60",{"$f":"VLOOKUP(I16,Base!$A:$I,2,FALSE)","v":6247466},{"$f":"VLOOKUP(I16,Base!$A:$I,4,FALSE)","v":"шт."},2,"910 SD 6x40",{"$f":"VLOOKUP(M16,Base!$A:$I,2,FALSE)","v":2351064},{"$f":"VLOOKUP(M16,Base!$A:$I,4,FALSE)","v":"шт."},11,"LKM I60100FS",{"$f":"VLOOKUP(Q16,Base!$A:$I,2,FALSE)","v":6248144},{"$f":"VLOOKUP(Q16,Base!$A:$I,4,FALSE)","v":"шт."},1,"LKM SV60",{"$f":"VLOOKUP(U16,Base!$A:$I,2,FALSE)","v":6247466},{"$f":"VLOOKUP(U16,Base!$A:$I,4,FALSE)","v":"шт."},4,"910 SD 6x40",{"$f":"VLOOKUP(Y16,Base!$A:$I,2,FALSE)","v":2351064},{"$f":"VLOOKUP(Y16,Base!$A:$I,4,FALSE)","v":"шт."},4,"LKM A60100RW",{"$f":"VLOOKUP(AC16,Base!$A:$I,2,FALSE)","v":6249574},{"$f":"VLOOKUP(AC16,Base!$A:$I,4,FALSE)","v":"шт."},1,"LKM SV60",{"$f":"VLOOKUP(AG16,Base!$A:$I,2,FALSE)","v":6247466},{"$f":"VLOOKUP(AG16,Base!$A:$I,4,FALSE)","v":"шт."},4,"910 SD 6x40",{"$f":"VLOOKUP(AK16,Base!$A:$I,2,FALSE)","v":2351064},{"$f":"VLOOKUP(AK16,Base!$A:$I,4,FALSE)","v":"шт."},4,"LKM T60100RW",{"$f":"VLOOKUP(AO16,Base!$A:$I,2,FALSE)","v":6249701},{"$f":"VLOOKUP(AO16,Base!$A:$I,4,FALSE)","v":"шт."},1,"LKM SV60",{"$f":"VLOOKUP(AS16,Base!$A:$I,2,FALSE)","v":6247466},{"$f":"VLOOKUP(AS16,Base!$A:$I,4,FALSE)","v":"шт."},6,"910 SD 6x40",{"$f":"VLOOKUP(AW16,Base!$A:$I,2,FALSE)","v":2351064},{"$f":"VLOOKUP(AW16,Base!$A:$I,4,FALSE)","v":"шт."},6,"LKM F60100RW",{"$f":"VLOOKUP(BA16,Base!$A:$I,2,FALSE)","v":6249507},{"$f":"VLOOKUP(BA16,Base!$A:$I,4,FALSE)","v":"шт."},1,"LKM SV60",{"$f":"VLOOKUP(BE16,Base!$A:$I,2,FALSE)","v":6247466},{"$f":"VLOOKUP(BE16,Base!$A:$I,4,FALSE)","v":"шт."},4,"910 SD 6x40",{"$f":"VLOOKUP(BI16,Base!$A:$I,2,FALSE)","v":2351064},{"$f":"VLOOKUP(BI16,Base!$A:$I,4,FALSE)","v":"шт."},4,"LKM E60100RW",{"$f":"VLOOKUP(BM16,Base!$A:$I,2,FALSE)","v":6249817},{"$f":"VLOOKUP(BM16,Base!$A:$I,4,FALSE)","v":"шт."},1,"KSR60100",{"$f":"VLOOKUP(BQ16,Base!$A:$I,2,FALSE)","v":6249852},{"$f":"VLOOKUP(BQ16,Base!$A:$I,4,FALSE)","v":"шт."},1,"LKM TWS55",{"$f":"VLOOKUP(BU16,Base!$A:$I,2,FALSE)","v":6249876},{"$f":"VLOOKUP(BU16,Base!$A:$I,4,FALSE)","v":"м"},1]
["LKM60100RW",{"$f":"VLOOKUP(A17,Base!$A:$I,2,FALSE)","v":6248624},{"$f":"VLOOKUP(A17,Base!$A:$I,4,FALSE)","v":"м"},2,"60х100",60,100,"Белый","LKM SV60",{"$f":"VLOOKUP(I17,Base!$A:$I,2,FALSE)","v":6247466},{"$f":"VLOOKUP(I17,Base!$A:$I,4,FALSE)","v":"шт."},2,"910 SD 6x40",{"$f":"VLOOKUP(M17,Base!$A:$I,2,FALSE)","v":2351064},{"$f":"VLOOKUP(M17,Base!$A:$I,4,FALSE)","v":"шт."},11,"LKM I60100RW",{"$f":"VLOOKUP(Q17,Base!$A:$I,2,FALSE)","v":6249639},{"$f":"VLOOKUP(Q17,Base!$A:$I,4,FALSE)","v":"шт."},1,"LKM SV60",{"$f":"VLOOKUP(U17,Base!$A:$I,2,FALSE)","v":6247466},{"$f":"VLOOKUP(U17,Base!$A:$I,4,FALSE)","v":"шт."},4,"910 SD 6x40",{"$f":"VLOOKUP(Y17,Base!$A:$I,2,FALSE)","v":2351064},{"$f":"VLOOKUP(Y17,Base!$A:$I,4,FALSE)","v":"шт."},4,"LKM A60100RW",{"$f":"VLOOKUP(AC17,Base!$A:$I,2,FALSE)","v":6249574},{"$f":"VLOOKUP(AC17,Base!$A:$I,4,FALSE)","v":"шт."},1,"LKM SV60",{"$f":"VLOOKUP(AG17,Base!$A:$I,2,FALSE)","v":6247466},{"$f":"VLOOKUP(AG17,Base!$A:$I,4,FALSE)","v":"шт."},4,"910 SD 6x40",{"$f":"VLOOKUP(AK17,Base!$A:$I,2,FALSE)","v":2351064},{"$f":"VLOOKUP(AK17,Base!$A:$I,4,FALSE)","v":"шт."},4,"LKM T60100RW",{"$f":"VLOOKUP(AO17,Base!$A:$I,2,FALSE)","v":6249701},{"$f":"VLOOKUP(AO17,Base!$A:$I,4,FALSE)","v":"шт."},1,"LKM SV60",{"$f":"VLOOKUP(AS17,Base!$A:$I,2,FALSE)","v":6247466},{"$f":"VLOOKUP(AS17,Base!$A:$I,4,FALSE)","v":"шт."},6,"910 SD 6x40",{"$f":"VLOOKUP(AW17,Base!$A:$I,2,FALSE)","v":2351064},{"$f":"VLOOKUP(AW17,Base!$A:$I,4,FALSE)","v":"шт."},6,"LKM F60100RW",{"$f":"VLOOKUP(BA17,Base!$A:$I,2,FALSE)","v":6249507},{"$f":"VLOOKUP(BA17,Base!$A:$I,4,FALSE)","v":"шт."},1,"LKM SV60",{"$f":"VLOOKUP(BE17,Base!$A:$I,2,FALSE)","v":6247466},{"$f":"VLOOKUP(BE17,Base!$A:$I,4,FALSE)","v":"шт."},4,"910 SD 6x40",{"$f":"VLOOKUP(BI17,Base!$A:$I,2,FALSE)","v":2351064},{"$f":"VLOOKUP(BI17,Base!$A:$I,4,FALSE)","v":"шт."},4,"LKM E60100RW",{"$f":"VLOOKUP(BM17,Base!$A:$I,2,FALSE)","v":6249817},{"$f":"VLOOKUP(BM17,Base!$A:$I,4,FALSE)","v":"шт."},1,"KSR60100",{"$f":"VLOOKUP(BQ17,Base!$A:$I,2,FALSE)","v":6249852},{"$f":"VLOOKUP(BQ17,Base!$A:$I,4,FALSE)","v":"шт."},1,"LKM TWS55",{"$f":"VLOOKUP(BU17,Base!$A:$I,2,FALSE)","v":6249876},{"$f":"VLOOKUP(BU17,Base!$A:$I,4,FALSE)","v":"м"},1]
["LKM60150FS",{"$f":"VLOOKUP(A18,Base!$A:$I,2,FALSE)","v":6247148},{"$f":"VLOOKUP(A18,Base!$A:$I,4,FALSE)","v":"м"},2,"60х150",60,150,"Сталь","LKM SV60",{"$f":"VLOOKUP(I18,Base!$A:$I,2,FALSE)","v":6247466},{"$f":"VLOOKUP(I18,Base!$A:$I,4,FALSE)","v":"шт."},2,"910 SD 6x40",{"$f":"VLOOKUP(M18,Base!$A:$I,2,FALSE)","v":2351064},{"$f":"VLOOKUP(M18,Base!$A:$I,4,FALSE)","v":"шт."},11,"LKM I60150FS",{"$f":"VLOOKUP(Q18,Base!$A:$I,2,FALSE)","v":6248152},{"$f":"VLOOKUP(Q18,Base!$A:$I,4,FALSE)","v":"шт."},1,"LKM SV60",{"$f":"VLOOKUP(U18,Base!$A:$I,2,FALSE)","v":6247466},{"$f":"VLOOKUP(U18,Base!$A:$I,4,FALSE)","v":"шт."},4,"910 SD 6x40",{"$f":"VLOOKUP(Y18,Base!$A:$I,2,FALSE)","v":2351064},{"$f":"VLOOKUP(Y18,Base!$A:$I,4,FALSE)","v":"шт."},4,"LKM A60150RW",{"$f":"VLOOKUP(AC18,Base!$A:$I,2,FALSE)","v":6249582},{"$f":"VLOOKUP(AC18,Base!$A:$I,4,FALSE)","v":"шт."},1,"LKM SV60",{"$f":"VLOOKUP(AG18,Base!$A:$I,2,FALSE)","v":6247466},{"$f":"VLOOKUP(AG18,Base!$A:$I,4,FALSE)","v":"шт."},4,"910 SD 6x40",{"$f":"VLOOKUP(AK18,Base!$A:$I,2,FALSE)","v":2351064},{"$f":"VLOOKUP(AK18,Base!$A:$I,4,FALSE)","v":"шт."},4,"LKM T60150RW",{"$f":"VLOOKUP(AO18,Base!$A:$I,2,FALSE)","v":6249728},{"$f":"VLOOKUP(AO18,Base!$A:$I,4,FALSE)","v":"шт."},1,"LKM SV60",{"$f":"VLOOKUP(AS18,Base!$A:$I,2,FALSE)","v":6247466},{"$f":"VLOOKUP(AS18,Base!$A:$I,4,FALSE)","v":"шт."},6,"910 SD 6x40",{"$f":"VLOOKUP(AW18,Base!$A:$I,2,FALSE)","v":2351064},{"$f":"VLOOKUP(AW18,Base!$A:$I,4,FALSE)","v":"шт."},6,"LKM F60150RW",{"$f":"VLOOKUP(BA18,Base!$A:$I,2,FALSE)","v":6249515},{"$f":"VLOOKUP(BA18,Base!$A:$I,4,FALSE)","v":"шт."},1,"LKM SV60",{"$f":"VLOOKUP(BE18,Base!$A:$I,2,FALSE)","v":6247466},{"$f":"VLOOKUP(BE18,Base!$A:$I,4,FALSE)","v":"шт."},4,"910 SD 6x40",{"$f":"VLOOKUP(BI18,Base!$A:$I,2,FALSE)","v":2351064},{"$f":"VLOOKUP(BI18,Base!$A:$I,4,FALSE)","v":"шт."},4,"LKM E60150RW",{"$f":"VLOOKUP(BM18,Base!$A:$I,2,FALSE)","v":6249825},{"$f":"VLOOKUP(BM18,Base!$A:$I,4,FALSE)","v":"шт."},1,"KSR60150",{"$f":"VLOOKUP(BQ18,Base!$A:$I,2,FALSE)","v":6249854},{"$f":"VLOOKUP(BQ18,Base!$A:$I,4,FALSE)","v":"шт."},1,"LKM TWS55",{"$f":"VLOOKUP(BU18,Base!$A:$I,2,FALSE)","v":6249876},{"$f":"VLOOKUP(BU18,Base!$A:$I,4,FALSE)","v":"м"},1]
["LKM60150RW",{"$f":"VLOOKUP(A19,Base!$A:$I,2,FALSE)","v":6248640},{"$f":"VLOOKUP(A19,Base!$A:$I,4,FALSE)","v":"м"},2,"60х150",60,150,"Белый","LKM SV60",{"$f":"VLOOKUP(I19,Base!$A:$I,2,FALSE)","v":6247466},{"$f":"VLOOKUP(I19,Base!$A:$I,4,FALSE)","v":"шт."},2,"910 SD 6x40",{"$f":"VLOOKUP(M19,Base!$A:$I,2,FALSE)","v":2351064},{"$f":"VLOOKUP(M19,Base!$A:$I,4,FALSE)","v":"шт."},11,"LKM I60150RW",{"$f":"VLOOKUP(Q19,Base!$A:$I,2,FALSE)","v":6249647},{"$f":"VLOOKUP(Q19,Base!$A:$I,4,FALSE)","v":"шт."},1,"LKM SV60",{"$f":"VLOOKUP(U19,Base!$A:$I,2,FALSE)","v":6247466},{"$f":"VLOOKUP(U19,Base!$A:$I,4,FALSE)","v":"шт."},4,"910 SD 6x40",{"$f":"VLOOKUP(Y19,Base!$A:$I,2,FALSE)","v":2351064},{"$f":"VLOOKUP(Y19,Base!$A:$I,4,FALSE)","v":"шт."},4,"LKM A60150RW",{"$f":"VLOOKUP(AC19,Base!$A:$I,2,FALSE)","v":6249582},{"$f":"VLOOKUP(AC19,Base!$A:$I,4,FALSE)","v":"шт."},1,"LKM SV60",{"$f":"VLOOKUP(AG19,Base!$A:$I,2,FALSE)","v":6247466},{"$f":"VLOOKUP(AG19,Base!$A:$I,4,FALSE)","v":"шт."},4,"910 SD 6x40",{"$f":"VLOOKUP(AK19,Base!$A:$I,2,FALSE)","v":2351064},{"$f":"VLOOKUP(AK19,Base!$A:$I,4,FALSE)","v":"шт."},4,"LKM T60150RW",{"$f":"VLOOKUP(AO19,Base!$A:$I,2,FALSE)","v":6249728},{"$f":"VLOOKUP(AO19,Base!$A:$I,4,FALSE)","v":"шт."},1,"LKM SV60",{"$f":"VLOOKUP(AS19,Base!$A:$I,2,FALSE)","v":6247466},{"$f":"VLOOKUP(AS19,Base!$A:$I,4,FALSE)","v":"шт."},6,"910 SD 6x40",{"$f":"VLOOKUP(AW19,Base!$A:$I,2,FALSE)","v":2351064},{"$f":"VLOOKUP(AW19,Base!$A:$I,4,FALSE)","v":"шт."},6,"LKM F60150RW",{"$f":"VLOOKUP(BA19,Base!$A:$I,2,FALSE)","v":6249515},{"$f":"VLOOKUP(BA19,Base!$A:$I,4,FALSE)","v":"шт."},1,"LKM SV60",{"$f":"VLOOKUP(BE19,Base!$A:$I,2,FALSE)","v":6247466},{"$f":"VLOOKUP(BE19,Base!$A:$I,4,FALSE)","v":"шт."},4,"910 SD 6x40",{"$f":"VLOOKUP(BI19,Base!$A:$I,2,FALSE)","v":2351064},{"$f":"VLOOKUP(BI19,Base!$A:$I,4,FALSE)","v":"шт."},4,"LKM E60150RW",{"$f":"VLOOKUP(BM19,Base!$A:$I,2,FALSE)","v":6249825},{"$f":"VLOOKUP(BM19,Base!$A:$I,4,FALSE)","v":"шт."},1,"KSR60150",{"$f":"VLOOKUP(BQ19,Base!$A:$I,2,FALSE)","v":6249854},{"$f":"VLOOKUP(BQ19,Base!$A:$I,4,FALSE)","v":"шт."},1,"LKM TWS55",{"$f":"VLOOKUP(BU19,Base!$A:$I,2,FALSE)","v":6249876},{"$f":"VLOOKUP(BU19,Base!$A:$I,4,FALSE)","v":"м"},1]
["LKM60200FS",{"$f":"VLOOKUP(A20,Base!$A:$I,2,FALSE)","v":6247164},{"$f":"VLOOKUP(A20,Base!$A:$I,4,FALSE)","v":"м"},2,"60х200",60,200,"Сталь","LKM SV60",{"$f":"VLOOKUP(I20,Base!$A:$I,2,FALSE)","v":6247466},{"$f":"VLOOKUP(I20,Base!$A:$I,4,FALSE)","v":"шт."},2,"910 SD 6x40",{"$f":"VLOOKUP(M20,Base!$A:$I,2,FALSE)","v":2351064},{"$f":"VLOOKUP(M20,Base!$A:$I,4,FALSE)","v":"шт."},11,"LKM I60200FS",{"$f":"VLOOKUP(Q20,Base!$A:$I,2,FALSE)","v":6248160},{"$f":"VLOOKUP(Q20,Base!$A:$I,4,FALSE)","v":"шт."},1,"LKM SV60",{"$f":"VLOOKUP(U20,Base!$A:$I,2,FALSE)","v":6247466},{"$f":"VLOOKUP(U20,Base!$A:$I,4,FALSE)","v":"шт."},4,"910 SD 6x40",{"$f":"VLOOKUP(Y20,Base!$A:$I,2,FALSE)","v":2351064},{"$f":"VLOOKUP(Y20,Base!$A:$I,4,FALSE)","v":"шт."},4,"LKM A60200RW",{"$f":"VLOOKUP(AC20,Base!$A:$I,2,FALSE)","v":6249590},{"$f":"VLOOKUP(AC20,Base!$A:$I,4,FALSE)","v":"шт."},1,"LKM SV60",{"$f":"VLOOKUP(AG20,Base!$A:$I,2,FALSE)","v":6247466},{"$f":"VLOOKUP(AG20,Base!$A:$I,4,FALSE)","v":"шт."},4,"910 SD 6x40",{"$f":"VLOOKUP(AK20,Base!$A:$I,2,FALSE)","v":2351064},{"$f":"VLOOKUP(AK20,Base!$A:$I,4,FALSE)","v":"шт."},4,"LKM T60200RW",{"$f":"VLOOKUP(AO20,Base!$A:$I,2,FALSE)","v":6249736},{"$f":"VLOOKUP(AO20,Base!$A:$I,4,FALSE)","v":"шт."},1,"LKM SV60",{"$f":"VLOOKUP(AS20,Base!$A:$I,2,FALSE)","v":6247466},{"$f":"VLOOKUP(AS20,Base!$A:$I,4,FALSE)","v":"шт."},6,"910 SD 6x40",{"$f":"VLOOKUP(AW20,Base!$A:$I,2,FALSE)","v":2351064},{"$f":"VLOOKUP(AW20,Base!$A:$I,4,FALSE)","v":"шт."},6,"LKM F60200RW",{"$f":"VLOOKUP(BA20,Base!$A:$I,2,FALSE)","v":6249523},{"$f":"VLOOKUP(BA20,Base!$A:$I,4,FALSE)","v":"шт."},1,"LKM SV60",{"$f":"VLOOKUP(BE20,Base!$A:$I,2,FALSE)","v":6247466},{"$f":"VLOOKUP(BE20,Base!$A:$I,4,FALSE)","v":"шт."},4,"910 SD 6x40",{"$f":"VLOOKUP(BI20,Base!$A:$I,2,FALSE)","v":2351064},{"$f":"VLOOKUP(BI20,Base!$A:$I,4,FALSE)","v":"шт."},4,"LKM E60200RW",{"$f":"VLOOKUP(BM20,Base!$A:$I,2,FALSE)","v":6249833},{"$f":"VLOOKUP(BM20,Base!$A:$I,4,FALSE)","v":"шт."},1,"KSR60200",{"$f":"VLOOKUP(BQ20,Base!$A:$I,2,FALSE)","v":6249856},{"$f":"VLOOKUP(BQ20,Base!$A:$I,4,FALSE)","v":"шт."},1,"LKM TWS55",{"$f":"VLOOKUP(BU20,Base!$A:$I,2,FALSE)","v":6249876},{"$f":"VLOOKUP(BU20,Base!$A:$I,4,FALSE)","v":"м"},1]
["LKM60200RW",{"$f":"VLOOKUP(A21,Base!$A:$I,2,FALSE)","v":6248667},{"$f":"VLOOKUP(A21,Base!$A:$I,4,FALSE)","v":"м"},2,"60х200",60,200,"Белый","LKM SV60",{"$f":"VLOOKUP(I21,Base!$A:$I,2,FALSE)","v":6247466},{"$f":"VLOOKUP(I21,Base!$A:$I,4,FALSE)","v":"шт."},2,"910 SD 6x40",{"$f":"VLOOKUP(M21,Base!$A:$I,2,FALSE)","v":2351064},{"$f":"VLOOKUP(M21,Base!$A:$I,4,FALSE)","v":"шт."},11,"LKM I60200RW",{"$f":"VLOOKUP(Q21,Base!$A:$I,2,FALSE)","v":6249655},{"$f":"VLOOKUP(Q21,Base!$A:$I,4,FALSE)","v":"шт."},1,"LKM SV60",{"$f":"VLOOKUP(U21,Base!$A:$I,2,FALSE)","v":6247466},{"$f":"VLOOKUP(U21,Base!$A:$I,4,FALSE)","v":"шт."},4,"910 SD 6x40",{"$f":"VLOOKUP(Y21,Base!$A:$I,2,FALSE)","v":2351064},{"$f":"VLOOKUP(Y21,Base!$A:$I,4,FALSE)","v":"шт."},4,"LKM A60200RW",{"$f":"VLOOKUP(AC21,Base!$A:$I,2,FALSE)","v":6249590},{"$f":"VLOOKUP(AC21,Base!$A:$I,4,FALSE)","v":"шт."},1,"LKM SV60",{"$f":"VLOOKUP(AG21,Base!$A:$I,2,FALSE)","v":6247466},{"$f":"VLOOKUP(AG21,Base!$A:$I,4,FALSE)","v":"шт."},4,"910 SD 6x40",{"$f":"VLOOKUP(AK21,Base!$A:$I,2,FALSE)","v":2351064},{"$f":"VLOOKUP(AK21,Base!$A:$I,4,FALSE)","v":"шт."},4,"LKM T60200RW",{"$f":"VLOOKUP(AO21,Base!$A:$I,2,FALSE)","v":6249736},{"$f":"VLOOKUP(AO21,Base!$A:$I,4,FALSE)","v":"шт."},1,"LKM SV60",{"$f":"VLOOKUP(AS21,Base!$A:$I,2,FALSE)","v":6247466},{"$f":"VLOOKUP(AS21,Base!$A:$I,4,FALSE)","v":"шт."},6,"910 SD 6x40",{"$f":"VLOOKUP(AW21,Base!$A:$I,2,FALSE)","v":2351064},{"$f":"VLOOKUP(AW21,Base!$A:$I,4,FALSE)","v":"шт."},6,"LKM F60200RW",{"$f":"VLOOKUP(BA21,Base!$A:$I,2,FALSE)","v":6249523},{"$f":"VLOOKUP(BA21,Base!$A:$I,4,FALSE)","v":"шт."},1,"LKM SV60",{"$f":"VLOOKUP(BE21,Base!$A:$I,2,FALSE)","v":6247466},{"$f":"VLOOKUP(BE21,Base!$A:$I,4,FALSE)","v":"шт."},4,"910 SD 6x40",{"$f":"VLOOKUP(BI21,Base!$A:$I,2,FALSE)","v":2351064},{"$f":"VLOOKUP(BI21,Base!$A:$I,4,FALSE)","v":"шт."},4,"LKM E60200RW",{"$f":"VLOOKUP(BM21,Base!$A:$I,2,FALSE)","v":6249833},{"$f":"VLOOKUP(BM21,Base!$A:$I,4,FALSE)","v":"шт."},1,"KSR60200",{"$f":"VLOOKUP(BQ21,Base!$A:$I,2,FALSE)","v":6249856},{"$f":"VLOOKUP(BQ21,Base!$A:$I,4,FALSE)","v":"шт."},1,"LKM TWS55",{"$f":"VLOOKUP(BU21,Base!$A:$I,2,FALSE)","v":6249876},{"$f":"VLOOKUP(BU21,Base!$A:$I,4,FALSE)","v":"м"},1]
["LKM80080FS",{"$f":"VLOOKUP(A22,Base!$A:$I,2,FALSE)","v":6247194},{"$f":"VLOOKUP(A22,Base!$A:$I,4,FALSE)","v":"м"},2,"80х80",80,80,"Сталь","LKM SV80",{"$f":"VLOOKUP(I22,Base!$A:$I,2,FALSE)","v":6247472},{"$f":"VLOOKUP(I22,Base!$A:$I,4,FALSE)","v":"шт."},2,"910 SD 6x40",{"$f":"VLOOKUP(M22,Base!$A:$I,2,FALSE)","v":2351064},{"$f":"VLOOKUP(M22,Base!$A:$I,4,FALSE)","v":"шт."},11,"LKM I80080FS",{"$f":"VLOOKUP(Q22,Base!$A:$I,2,FALSE)","v":6248336},{"$f":"VLOOKUP(Q22,Base!$A:$I,4,FALSE)","v":"шт."},1,"LKM SV80",{"$f":"VLOOKUP(U22,Base!$A:$I,2,FALSE)","v":6247472},{"$f":"VLOOKUP(U22,Base!$A:$I,4,FALSE)","v":"шт."},4,"910 SD 6x40",{"$f":"VLOOKUP(Y22,Base!$A:$I,2,FALSE)","v":2351064},{"$f":"VLOOKUP(Y22,Base!$A:$I,4,FALSE)","v":"шт."},4,"LKM A80080RW",{"$f":"VLOOKUP(AC22,Base!$A:$I,2,FALSE)","v":6248432},{"$f":"VLOOKUP(AC22,Base!$A:$I,4,FALSE)","v":"шт."},1,"LKM SV80",{"$f":"VLOOKUP(AG22,Base!$A:$I,2,FALSE)","v":6247472},{"$f":"VLOOKUP(AG22,Base!$A:$I,4,FALSE)","v":"шт."},4,"910 SD 6x40",{"$f":"VLOOKUP(AK22,Base!$A:$I,2,FALSE)","v":2351064},{"$f":"VLOOKUP(AK22,Base!$A:$I,4,FALSE)","v":"шт."},4,"LKM T80080RW",{"$f":"VLOOKUP(AO22,Base!$A:$I,2,FALSE)","v":6248450},{"$f":"VLOOKUP(AO22,Base!$A:$I,4,FALSE)","v":"шт."},1,"LKM SV80",{"$f":"VLOOKUP(AS22,Base!$A:$I,2,FALSE)","v":6247472},{"$f":"VLOOKUP(AS22,Base!$A:$I,4,FALSE)","v":"шт."},6,"910 SD 6x40",{"$f":"VLOOKUP(AW22,Base!$A:$I,2,FALSE)","v":2351064},{"$f":"VLOOKUP(AW22,Base!$A:$I,4,FALSE)","v":"шт."},6,"LKM F80080RW",{"$f":"VLOOKUP(BA22,Base!$A:$I,2,FALSE)","v":6248428},{"$f":"VLOOKUP(BA22,Base!$A:$I,4,FALSE)","v":"шт."},1,"LKM SV80",{"$f":"VLOOKUP(BE22,Base!$A:$I,2,FALSE)","v":6247472},{"$f":"VLOOKUP(BE22,Base!$A:$I,4,FALSE)","v":"шт."},4,"910 SD 6x40",{"$f":"VLOOKUP(BI22,Base!$A:$I,2,FALSE)","v":2351064},{"$f":"VLOOKUP(BI22,Base!$A:$I,4,FALSE)","v":"шт."},4,"LKM E80080RW",{"$f":"VLOOKUP(BM22,Base!$A:$I,2,FALSE)","v":6248454},{"$f":"VLOOKUP(BM22,Base!$A:$I,4,FALSE)","v":"шт."},1,"KSR80080",{"$f":"VLOOKUP(BQ22,Base!$A:$I,2,FALSE)","v":6249865},{"$f":"VLOOKUP(BQ22,Base!$A:$I,4,FALSE)","v":"шт."},1,"LKM TWS75",{"$f":"VLOOKUP(BU22,Base!$A:$I,2,FALSE)","v":6249880},{"$f":"VLOOKUP(BU22,Base!$A:$I,4,FALSE)","v":"м"},1]
["LKM80080RW",{"$f":"VLOOKUP(A23,Base!$A:$I,2,FALSE)","v":6248694},{"$f":"VLOOKUP(A23,Base!$A:$I,4,FALSE)","v":"м"},2,"80х80",80,80,"Белый","LKM SV80",{"$f":"VLOOKUP(I23,Base!$A:$I,2,FALSE)","v":6247472},{"$f":"VLOOKUP(I23,Base!$A:$I,4,FALSE)","v":"шт."},2,"910 SD 6x40",{"$f":"VLOOKUP(M23,Base!$A:$I,2,FALSE)","v":2351064},{"$f":"VLOOKUP(M23,Base!$A:$I,4,FALSE)","v":"шт."},11,"LKM I80080RW",{"$f":"VLOOKUP(Q23,Base!$A:$I,2,FALSE)","v":6248436},{"$f":"VLOOKUP(Q23,Base!$A:$I,4,FALSE)","v":"шт."},1,"LKM SV80",{"$f":"VLOOKUP(U23,Base!$A:$I,2,FALSE)","v":6247472},{"$f":"VLOOKUP(U23,Base!$A:$I,4,FALSE)","v":"шт."},4,"910 SD 6x40",{"$f":"VLOOKUP(Y23,Base!$A:$I,2,FALSE)","v":2351064},{"$f":"VLOOKUP(Y23,Base!$A:$I,4,FALSE)","v":"шт."},4,"LKM A80080RW",{"$f":"VLOOKUP(AC23,Base!$A:$I,2,FALSE)","v":6248432},{"$f":"VLOOKUP(AC23,Base!$A:$I,4,FALSE)","v":"шт."},1,"LKM SV80",{"$f":"VLOOKUP(AG23,Base!$A:$I,2,FALSE)","v":6247472},{"$f":"VLOOKUP(AG23,Base!$A:$I,4,FALSE)","v":"шт."},4,"910 SD 6x40",{"$f":"VLOOKUP(AK23,Base!$A:$I,2,FALSE)","v":2351064},{"$f":"VLOOKUP(AK23,Base!$A:$I,4,FALSE)","v":"шт."},4,"LKM T80080RW",{"$f":"VLOOKUP(AO23,Base!$A:$I,2,FALSE)","v":6248450},{"$f":"VLOOKUP(AO23,Base!$A:$I,4,FALSE)","v":"шт."},1,"LKM SV80",{"$f":"VLOOKUP(AS23,Base!$A:$I,2,FALSE)","v":6247472},{"$f":"VLOOKUP(AS23,Base!$A:$I,4,FALSE)","v":"шт."},6,"910 SD 6x40",{"$f":"VLOOKUP(AW23,Base!$A:$I,2,FALSE)","v":2351064},{"$f":"VLOOKUP(AW23,Base!$A:$I,4,FALSE)","v":"шт."},6,"LKM F80080RW",{"$f":"VLOOKUP(BA23,Base!$A:$I,2,FALSE)","v":6248428},{"$f":"VLOOKUP(BA23,Base!$A:$I,4,FALSE)","v":"шт."},1,"LKM SV80",{"$f":"VLOOKUP(BE23,Base!$A:$I,2,FALSE)","v":6247472},{"$f":"VLOOKUP(BE23,Base!$A:$I,4,FALSE)","v":"шт."},4,"910 SD 6x40",{"$f":"VLOOKUP(BI23,Base!$A:$I,2,FALSE)","v":2351064},{"$f":"VLOOKUP(BI23,Base!$A:$I,4,FALSE)","v":"шт."},4,"LKM E80080RW",{"$f":"VLOOKUP(BM23,Base!$A:$I,2,FALSE)","v":6248454},{"$f":"VLOOKUP(BM23,Base!$A:$I,4,FALSE)","v":"шт."},1,"KSR80080",{"$f":"VLOOKUP(BQ23,Base!$A:$I,2,FALSE)","v":6249865},{"$f":"VLOOKUP(BQ23,Base!$A:$I,4,FALSE)","v":"шт."},1,"LKM TWS75",{"$f":"VLOOKUP(BU23,Base!$A:$I,2,FALSE)","v":6249880},{"$f":"VLOOKUP(BU23,Base!$A:$I,4,FALSE)","v":"м"},1]
["---","---","---",null,"---","---","---","---","---","---","---","---","---","---","---","---","---","---","---","---","---","---","---","---","---","---","---","---","---","---","---","---","---","---","---","---","---","---","---","---","---","---","---","---","---","---","---","---","---","---","---","---","---","---","---","---","---","---","---","---","---","---","---","---","---","---","---","---","---","---","---","---","---","---","---","---"]
[]
["---","---","---",null,"---","---","---","---","---","---","---","---","---","---","---","---","---","---","---","---","---","---","---","---","---","---","---","---","---","---","---","---","---","---","---","---","---","---","---","---","---","---","---","---","---","---","---","---","---","---","---","---","---","---","---","---","---","---","---","---","---","---","---","---","---","---","---","---","---","---","---","---","---","---","---","---"]

{"sheet":"Исходные данные","index":2,"n_rows":73,"n_cols":9,"rows_kept":73,"cut":false,"hidden":false,"merged":[[10,5,10,6],[16,5,16,6],[1,0,1,21],[3,0,3,21],[4,0,4,21],[15,5,15,6]]}
[]
["КАЛЬКУЛЯТОР"]
[]
["РАСЧЕТА КАБЕЛЬНЫХ ТРАСС"]
["на основе металлических лотков серии LKM"]
[]
[]
[]
[]
[]
[null,null,null,null,null,"ВЫБЕРИТЕ ДАННЫЕ:"]
[null,null,null,null,null,"Размер A, мм"]
[null,null,null,null,null,"Размер B, мм"]
[null,null,null,null,null,"Цвет короба"]
[null,null,null,null,null,"Перегородка","---"]
[]
[null,null,null,null,null,"ВВЕДИТЕ КОЛИЧЕСТВО:"]
[null,null,null,null,null,"Длина трассы, м",null,null,"Примечания:"]
[null,null,null,null,null,"Внутренний угол, шт.","---",null,"\"---\" - Для выбранных размеров короба данный элемент отсутствует."]
[null,null,null,null,null,"Внешний угол, шт.","---"]
[null,null,null,null,null,"Т-образная секция, шт.","---"]
[null,null,null,null,null,"Плоский угол, шт.","---"]
[null,null,null,null,null,"Заглушка, шт.","---"]
[null,null,null,null,null,"Кольцо для защиты кромок, шт.",null,null,{"$f":"IF(G24=\"---\",\"Внимание! Для выбранных размеров короба данный элемент отсутствует.\",\"\")","v":""}]
[]
[]
[]
[]
[]
[]
[]
[]
[]
[]
[]
[]
[]
[]
[]
[]
[]
[]
[]
[]
[]
[]
[]
[]
[]
[]
[]
[]
[]
[]
[]
[null,null,null,null,null,"Короб",{"$f":"IFERROR(INDEX(BL!$A$3:$BX$26,MATCH($G$12&$G$13&$G$14,BL!$F$3:$F$26&BL!$G$3:$G$26&BL!$H$3:$H$26,0),MATCH('Исходные данные'!$F56,BL!$A$1:$BX$1,0)),\"---\")","v":0},{"$f":"IFERROR(CEILING($G$18,INDEX(BL!$A$3:$BX$26,MATCH($G$12&$G$13&$G$14,BL!$F$3:$F$26&BL!$G$3:$G$26&BL!$H$3:$H$26,0),MATCH('Исходные данные'!$F$56,BL!$A$1:$BX$1,0)+3)),\"---\")","v":0}]
[null,null,null,null,null,"Стыковой соединитель",{"$f":"IFERROR(INDEX(BL!$A$3:$BX$26,MATCH($G$12&$G$13&$G$14,BL!$F$3:$F$26&BL!$G$3:$G$26&BL!$H$3:$H$26,0),MATCH('Исходные данные'!$F57,BL!$A$1:$BX$1,0)),\"---\")","v":0},{"$f":"IFERROR(FLOOR($H$56/INDEX(BL!$A$3:$BX$26,MATCH($G$12&$G$13&$G$14,BL!$F$3:$F$26&BL!$G$3:$G$26&BL!$H$3:$H$26,0),MATCH('Исходные данные'!$F56,BL!$A$1:$BX$1,0)+3),1)*INDEX(BL!$A$3:$BX$26,MATCH($G$12&$G$13&$G$14,BL!$F$3:$F$26&BL!$G$3:$G$26&BL!$H$3:$H$26,0),MATCH('Исходные данные'!$F57,BL!$A$1:$BX$1,0)+3),\"---\")","v":"---"}]
[null,null,null,null,null,"Крепеж короба",{"$f":"IFERROR(INDEX(BL!$A$3:$BX$26,MATCH($G$12&$G$13&$G$14,BL!$F$3:$F$26&BL!$G$3:$G$26&BL!$H$3:$H$26,0),MATCH('Исходные данные'!$F58,BL!$A$1:$BX$1,0)),\"---\")","v":0},{"$f":"IFERROR(FLOOR($H$56/INDEX(BL!$A$3:$BX$26,MATCH($G$12&$G$13&$G$14,BL!$F$3:$F$26&BL!$G$3:$G$26&BL!$H$3:$H$26,0),MATCH('Исходные данные'!$F56,BL!$A$1:$BX$1,0)+3),1)*INDEX(BL!$A$3:$BX$26,MATCH($G$12&$G$13&$G$14,BL!$F$3:$F$26&BL!$G$3:$G$26&BL!$H$3:$H$26,0),MATCH('Исходные данные'!$F58,BL!$A$1:$BX$1,0)+3),\"---\")","v":"---"}]
[null,null,null,null,null,"Внутренний угол",{"$f":"IFERROR(INDEX(BL!$A$3:$BX$26,MATCH($G$12&$G$13&$G$14,BL!$F$3:$F$26&BL!$G$3:$G$26&BL!$H$3:$H$26,0),MATCH('Исходные данные'!$F59,BL!$A$1:$BX$1,0)),\"---\")","v":0},{"$f":"IFERROR($G$19,\"---\")","v":"---"}]
[null,null,null,null,null,"Стык. соед. внутреннего угла",{"$f":"IFERROR(INDEX(BL!$A$3:$BX$26,MATCH($G$12&$G$13&$G$14,BL!$F$3:$F$26&BL!$G$3:$G$26&BL!$H$3:$H$26,0),MATCH('Исходные данные'!$F60,BL!$A$1:$BX$1,0)),\"---\")","v":0},{"$f":"IFERROR($H$59*INDEX(BL!$A$3:$BX$26,MATCH($G$12&$G$13&$G$14,BL!$F$3:$F$26&BL!$G$3:$G$26&BL!$H$3:$H$26,0),MATCH('Исходные данные'!$F60,BL!$A$1:$BX$1,0)+3),\"---\")","v":"---"}]
[null,null,null,null,null,"Крепеж внутреннего угла",{"$f":"IFERROR(INDEX(BL!$A$3:$BX$26,MATCH($G$12&$G$13&$G$14,BL!$F$3:$F$26&BL!$G$3:$G$26&BL!$H$3:$H$26,0),MATCH('Исходные данные'!$F61,BL!$A$1:$BX$1,0)),\"---\")","v":0},{"$f":"IFERROR($H$59*INDEX(BL!$A$3:$BX$26,MATCH($G$12&$G$13&$G$14,BL!$F$3:$F$26&BL!$G$3:$G$26&BL!$H$3:$H$26,0),MATCH('Исходные данные'!$F61,BL!$A$1:$BX$1,0)+3),\"---\")","v":"---"}]
[null,null,null,null,null,"Внешний угол",{"$f":"IFERROR(INDEX(BL!$A$3:$BX$26,MATCH($G$12&$G$13&$G$14,BL!$F$3:$F$26&BL!$G$3:$G$26&BL!$H$3:$H$26,0),MATCH('Исходные данные'!$F62,BL!$A$1:$BX$1,0)),\"---\")","v":0},{"$f":"IFERROR($G$20,\"---\")","v":"---"}]
[null,null,null,null,null,"Стык. соед. внешнего угла",{"$f":"IFERROR(INDEX(BL!$A$3:$BX$26,MATCH($G$12&$G$13&$G$14,BL!$F$3:$F$26&BL!$G$3:$G$26&BL!$H$3:$H$26,0),MATCH('Исходные данные'!$F63,BL!$A$1:$BX$1,0)),\"---\")","v":0},{"$f":"IFERROR($H$62*INDEX(BL!$A$3:$BX$26,MATCH($G$12&$G$13&$G$14,BL!$F$3:$F$26&BL!$G$3:$G$26&BL!$H$3:$H$26,0),MATCH('Исходные данные'!$F63,BL!$A$1:$BX$1,0)+3),\"---\")","v":"---"}]
[null,null,null,null,null,"Крепеж внешнего угла",{"$f":"IFERROR(INDEX(BL!$A$3:$BX$26,MATCH($G$12&$G$13&$G$14,BL!$F$3:$F$26&BL!$G$3:$G$26&BL!$H$3:$H$26,0),MATCH('Исходные данные'!$F64,BL!$A$1:$BX$1,0)),\"---\")","v":0},{"$f":"IFERROR($H$62*INDEX(BL!$A$3:$BX$26,MATCH($G$12&$G$13&$G$14,BL!$F$3:$F$26&BL!$G$3:$G$26&BL!$H$3:$H$26,0),MATCH('Исходные данные'!$F64,BL!$A$1:$BX$1,0)+3),\"---\")","v":"---"}]
[null,null,null,null,null,"Т-образная секция",{"$f":"IFERROR(INDEX(BL!$A$3:$BX$26,MATCH($G$12&$G$13&$G$14,BL!$F$3:$F$26&BL!$G$3:$G$26&BL!$H$3:$H$26,0),MATCH('Исходные данные'!$F65,BL!$A$1:$BX$1,0)),\"---\")","v":0},{"$f":"IFERROR($G$21,\"---\")","v":"---"}]
[null,null,null,null,null,"Стык. соед. Т-образной секции",{"$f":"IFERROR(INDEX(BL!$A$3:$BX$26,MATCH($G$12&$G$13&$G$14,BL!$F$3:$F$26&BL!$G$3:$G$26&BL!$H$3:$H$26,0),MATCH('Исходные данные'!$F66,BL!$A$1:$BX$1,0)),\"---\")","v":0},{"$f":"IFERROR($H$65*INDEX(BL!$A$3:$BX$26,MATCH($G$12&$G$13&$G$14,BL!$F$3:$F$26&BL!$G$3:$G$26&BL!$H$3:$H$26,0),MATCH('Исходные данные'!$F66,BL!$A$1:$BX$1,0)+3),\"---\")","v":"---"}]
[null,null,null,null,null,"Крепеж Т-образной секции",{"$f":"IFERROR(INDEX(BL!$A$3:$BX$26,MATCH($G$12&$G$13&$G$14,BL!$F$3:$F$26&BL!$G$3:$G$26&BL!$H$3:$H$26,0),MATCH('Исходные данные'!$F67,BL!$A$1:$BX$1,0)),\"---\")","v":0},{"$f":"IFERROR($H$65*INDEX(BL!$A$3:$BX$26,MATCH($G$12&$G$13&$G$14,BL!$F$3:$F$26&BL!$G$3:$G$26&BL!$H$3:$H$26,0),MATCH('Исходные данные'!$F67,BL!$A$1:$BX$1,0)+3),\"---\")","v":"---"}]
[null,null,null,null,null,"Плоский угол",{"$f":"IFERROR(INDEX(BL!$A$3:$BX$26,MATCH($G$12&$G$13&$G$14,BL!$F$3:$F$26&BL!$G$3:$G$26&BL!$H$3:$H$26,0),MATCH('Исходные данные'!$F68,BL!$A$1:$BX$1,0)),\"---\")","v":0},{"$f":"IFERROR($G$22,\"---\")","v":"---"}]
[null,null,null,null,null,"Стык. соед. плоского угла",{"$f":"IFERROR(INDEX(BL!$A$3:$BX$26,MATCH($G$12&$G$13&$G$14,BL!$F$3:$F$26&BL!$G$3:$G$26&BL!$H$3:$H$26,0),MATCH('Исходные данные'!$F69,BL!$A$1:$BX$1,0)),\"---\")","v":0},{"$f":"IFERROR($H$68*INDEX(BL!$A$3:$BX$26,MATCH($G$12&$G$13&$G$14,BL!$F$3:$F$26&BL!$G$3:$G$26&BL!$H$3:$H$26,0),MATCH('Исходные данные'!$F69,BL!$A$1:$BX$1,0)+3),\"---\")","v":"---"}]
[null,null,null,null,null,"Крепеж плоского угла",{"$f":"IFERROR(INDEX(BL!$A$3:$BX$26,MATCH($G$12&$G$13&$G$14,BL!$F$3:$F$26&BL!$G$3:$G$26&BL!$H$3:$H$26,0),MATCH('Исходные данные'!$F70,BL!$A$1:$BX$1,0)),\"---\")","v":0},{"$f":"IFERROR($H$68*INDEX(BL!$A$3:$BX$26,MATCH($G$12&$G$13&$G$14,BL!$F$3:$F$26&BL!$G$3:$G$26&BL!$H$3:$H$26,0),MATCH('Исходные данные'!$F70,BL!$A$1:$BX$1,0)+3),\"---\")","v":"---"}]
[null,null,null,null,null,"Заглушка",{"$f":"IFERROR(INDEX(BL!$A$3:$BX$26,MATCH($G$12&$G$13&$G$14,BL!$F$3:$F$26&BL!$G$3:$G$26&BL!$H$3:$H$26,0),MATCH('Исходные данные'!$F71,BL!$A$1:$BX$1,0)),\"---\")","v":0},{"$f":"IFERROR($G$23,\"---\")","v":"---"}]
[null,null,null,null,null,"Кольцо для защиты кромок",{"$f":"IFERROR(INDEX(BL!$A$3:$BX$26,MATCH($G$12&$G$13&$G$14,BL!$F$3:$F$26&BL!$G$3:$G$26&BL!$H$3:$H$26,0),MATCH('Исходные данные'!$F72,BL!$A$1:$BX$1,0)),\"---\")","v":0},{"$f":"IFERROR($G$24,\"---\")","v":0}]
[null,null,null,null,null,"Перегородка",{"$f":"IFERROR(INDEX(BL!$A$3:$BX$26,MATCH($G$12&$G$13&$G$14,BL!$F$3:$F$26&BL!$G$3:$G$26&BL!$H$3:$H$26,0),MATCH('Исходные данные'!$F73,BL!$A$1:$BX$1,0)),\"---\")","v":0},{"$f":"IFERROR($H$56*$G$15,\"---\")","v":"---"}]

{"sheet":"SS2","index":3,"n_rows":19,"n_cols":33,"rows_kept":19,"cut":false,"hidden":true,"merged":[]}
["№","Обозначение","Наименование","Кол-во","Масса","Примечание",null,"№","Наименование","Тип","Артикул","Поставщик","Ед.изм.","Кол-во","Масса","Примечание",null,"№","Обозначение","Наименование","Масса","Примечание","Сумма по полю Кол-во",null,"№","Наименование","Тип","Артикул","Поставщик","Ед.изм.","Масса","Примечание","Сумма по полю Кол-во"]
[{"$f":"H2","v":{"$error":"#N/A"}},{"$f":"CONCATENATE(J2, \" (арт. \",K2,\")\")","v":{"$error":"#N/A"}},{"$f":"I2","v":{"$error":"#N/A"}},{"$f":"N2","v":0},{"$f":"O2","v":{"$error":"#N/A"}},{"$f":"P2","v":{"$error":"#N/A"}},null,{"$f":"VLOOKUP($J2,Base!$A:$I,7,FALSE)","v":{"$error":"#N/A"}},{"$f":"VLOOKUP($J2,Base!$A:$I,3,FALSE)","v":{"$error":"#N/A"}},{"$f":"'Исходные данные'!G56","v":0},{"$f":"VLOOKUP($J2,Base!$A:$I,2,FALSE)","v":{"$error":"#N/A"}},"ООО ''ОБО Беттерманн'', г.Липецк",{"$f":"VLOOKUP($J2,Base!$A:$I,4,FALSE)","v":{"$error":"#N/A"}},{"$f":"'Исходные данные'!H56","v":0},{"$f":"VLOOKUP($J2,Base!$A:$I,5,FALSE)","v":{"$error":"#N/A"}},{"$f":"VLOOKUP($J2,Base!$A:$I,6,FALSE)","v":{"$error":"#N/A"}},null,"#Н/Д","#Н/Д","#Н/Д","#Н/Д","#Н/Д",0,null,"#Н/Д","#Н/Д",0,"#Н/Д","ООО ''ОБО Беттерманн'', г.Липецк","#Н/Д","#Н/Д","#Н/Д",0]
[{"$f":"H3","v":{"$error":"#N/A"}},{"$f":"CONCATENATE(J3, \" (арт. \",K3,\")\")","v":{"$error":"#N/A"}},{"$f":"I3","v":{"$error":"#N/A"}},{"$f":"N3","v":"---"},{"$f":"O3","v":{"$error":"#N/A"}},{"$f":"P3","v":{"$error":"#N/A"}},null,{"$f":"VLOOKUP($J3,Base!$A:$I,7,FALSE)","v":{"$error":"#N/A"}},{"$f":"VLOOKUP($J3,Base!$A:$I,3,FALSE)","v":{"$error":"#N/A"}},{"$f":"'Исходные данные'!G57","v":0},{"$f":"VLOOKUP($J3,Base!$A:$I,2,FALSE)","v":{"$error":"#N/A"}},"ООО ''ОБО Беттерманн'', г.Липецк",{"$f":"VLOOKUP($J3,Base!$A:$I,4,FALSE)","v":{"$error":"#N/A"}},{"$f":"'Исходные данные'!H57","v":"---"},{"$f":"VLOOKUP($J3,Base!$A:$I,5,FALSE)","v":{"$error":"#N/A"}},{"$f":"VLOOKUP($J3,Base!$A:$I,6,FALSE)","v":{"$error":"#N/A"}},null,"(пусто)","(пусто)","(пусто)","(пусто)","(пусто)",null,null,"(пусто)","(пусто)","(пусто)","(пусто)","(пусто)","(пусто)","(пусто)","(пусто)"]
[{"$error":"#N/A"},{"$error":"#N/A"},{"$error":"#N/A"},"---",{"$error":"#N/A"},{"$error":"#N/A"},null,{"$f":"VLOOKUP($J4,Base!$A:$I,7,FALSE)","v":{"$error":"#N/A"}},{"$f":"VLOOKUP($J4,Base!$A:$I,3,FALSE)","v":{"$error":"#N/A"}},{"$f":"'Исходные данные'!G58","v":0},{"$f":"VLOOKUP($J4,Base!$A:$I,2,FALSE)","v":{"$error":"#N/A"}},"ООО ''ОБО Беттерманн'', г.Липецк",{"$f":"VLOOKUP($J4,Base!$A:$I,4,FALSE)","v":{"$error":"#N/A"}},{"$f":"'Исходные данные'!H58","v":"---"},{"$f":"VLOOKUP($J4,Base!$A:$I,5,FALSE)","v":{"$error":"#N/A"}},{"$f":"VLOOKUP($J4,Base!$A:$I,6,FALSE)","v":{"$error":"#N/A"}},null,"Общий итог",null,null,null,null,0,null,"Общий итог",null,null,null,null,null,null,null,0]
[{"$error":"#N/A"},{"$error":"#N/A"},{"$error":"#N/A"},"---",{"$error":"#N/A"},{"$error":"#N/A"},null,{"$f":"VLOOKUP($J5,Base!$A:$I,7,FALSE)","v":{"$error":"#N/A"}},{"$f":"VLOOKUP($J5,Base!$A:$I,3,FALSE)","v":{"$error":"#N/A"}},{"$f":"'Исходные данные'!G59","v":0},{"$f":"VLOOKUP($J5,Base!$A:$I,2,FALSE)","v":{"$error":"#N/A"}},"ООО ''ОБО Беттерманн'', г.Липецк",{"$f":"VLOOKUP($J5,Base!$A:$I,4,FALSE)","v":{"$error":"#N/A"}},{"$f":"'Исходные данные'!H59","v":"---"},{"$f":"VLOOKUP($J5,Base!$A:$I,5,FALSE)","v":{"$error":"#N/A"}},{"$f":"VLOOKUP($J5,Base!$A:$I,6,FALSE)","v":{"$error":"#N/A"}}]
[{"$error":"#N/A"},{"$error":"#N/A"},{"$error":"#N/A"},"---",{"$error":"#N/A"},{"$error":"#N/A"},null,{"$f":"VLOOKUP($J6,Base!$A:$I,7,FALSE)","v":{"$error":"#N/A"}},{"$f":"VLOOKUP($J6,Base!$A:$I,3,FALSE)","v":{"$error":"#N/A"}},{"$f":"'Исходные данные'!G60","v":0},{"$f":"VLOOKUP($J6,Base!$A:$I,2,FALSE)","v":{"$error":"#N/A"}},"ООО ''ОБО Беттерманн'', г.Липецк",{"$f":"VLOOKUP($J6,Base!$A:$I,4,FALSE)","v":{"$error":"#N/A"}},{"$f":"'Исходные данные'!H60","v":"---"},{"$f":"VLOOKUP($J6,Base!$A:$I,5,FALSE)","v":{"$error":"#N/A"}},{"$f":"VLOOKUP($J6,Base!$A:$I,6,FALSE)","v":{"$error":"#N/A"}}]
[{"$error":"#N/A"},{"$error":"#N/A"},{"$error":"#N/A"},"---",{"$error":"#N/A"},{"$error":"#N/A"},null,{"$f":"VLOOKUP($J7,Base!$A:$I,7,FALSE)","v":{"$error":"#N/A"}},{"$f":"VLOOKUP($J7,Base!$A:$I,3,FALSE)","v":{"$error":"#N/A"}},{"$f":"'Исходные данные'!G61","v":0},{"$f":"VLOOKUP($J7,Base!$A:$I,2,FALSE)","v":{"$error":"#N/A"}},"ООО ''ОБО Беттерманн'', г.Липецк",{"$f":"VLOOKUP($J7,Base!$A:$I,4,FALSE)","v":{"$error":"#N/A"}},{"$f":"'Исходные данные'!H61","v":"---"},{"$f":"VLOOKUP($J7,Base!$A:$I,5,FALSE)","v":{"$error":"#N/A"}},{"$f":"VLOOKUP($J7,Base!$A:$I,6,FALSE)","v":{"$error":"#N/A"}}]
[{"$error":"#N/A"},{"$error":"#N/A"},{"$error":"#N/A"},"---",{"$error":"#N/A"},{"$error":"#N/A"},null,{"$f":"VLOOKUP($J8,Base!$A:$I,7,FALSE)","v":{"$error":"#N/A"}},{"$f":"VLOOKUP($J8,Base!$A:$I,3,FALSE)","v":{"$error":"#N/A"}},{"$f":"'Исходные данные'!G62","v":0},{"$f":"VLOOKUP($J8,Base!$A:$I,2,FALSE)","v":{"$error":"#N/A"}},"ООО ''ОБО Беттерманн'', г.Липецк",{"$f":"VLOOKUP($J8,Base!$A:$I,4,FALSE)","v":{"$error":"#N/A"}},{"$f":"'Исходные данные'!H62","v":"---"},{"$f":"VLOOKUP($J8,Base!$A:$I,5,FALSE)","v":{"$error":"#N/A"}},{"$f":"VLOOKUP($J8,Base!$A:$I,6,FALSE)","v":{"$error":"#N/A"}}]
[{"$error":"#N/A"},{"$error":"#N/A"},{"$error":"#N/A"},"---",{"$error":"#N/A"},{"$error":"#N/A"},null,{"$f":"VLOOKUP($J9,Base!$A:$I,7,FALSE)","v":{"$error":"#N/A"}},{"$f":"VLOOKUP($J9,Base!$A:$I,3,FALSE)","v":{"$error":"#N/A"}},{"$f":"'Исходные данные'!G63","v":0},{"$f":"VLOOKUP($J9,Base!$A:$I,2,FALSE)","v":{"$error":"#N/A"}},"ООО ''ОБО Беттерманн'', г.Липецк",{"$f":"VLOOKUP($J9,Base!$A:$I,4,FALSE)","v":{"$error":"#N/A"}},{"$f":"'Исходные данные'!H63","v":"---"},{"$f":"VLOOKUP($J9,Base!$A:$I,5,FALSE)","v":{"$error":"#N/A"}},{"$f":"VLOOKUP($J9,Base!$A:$I,6,FALSE)","v":{"$error":"#N/A"}}]
[{"$error":"#N/A"},{"$error":"#N/A"},{"$error":"#N/A"},"---",{"$error":"#N/A"},{"$error":"#N/A"},null,{"$f":"VLOOKUP($J10,Base!$A:$I,7,FALSE)","v":{"$error":"#N/A"}},{"$f":"VLOOKUP($J10,Base!$A:$I,3,FALSE)","v":{"$error":"#N/A"}},{"$f":"'Исходные данные'!G64","v":0},{"$f":"VLOOKUP($J10,Base!$A:$I,2,FALSE)","v":{"$error":"#N/A"}},"ООО ''ОБО Беттерманн'', г.Липецк",{"$f":"VLOOKUP($J10,Base!$A:$I,4,FALSE)","v":{"$error":"#N/A"}},{"$f":"'Исходные данные'!H64","v":"---"},{"$f":"VLOOKUP($J10,Base!$A:$I,5,FALSE)","v":{"$error":"#N/A"}},{"$f":"VLOOKUP($J10,Base!$A:$I,6,FALSE)","v":{"$error":"#N/A"}}]
[{"$error":"#N/A"},{"$error":"#N/A"},{"$error":"#N/A"},"---",{"$error":"#N/A"},{"$error":"#N/A"},null,{"$f":"VLOOKUP($J11,Base!$A:$I,7,FALSE)","v":{"$error":"#N/A"}},{"$f":"VLOOKUP($J11,Base!$A:$I,3,FALSE)","v":{"$error":"#N/A"}},{"$f":"'Исходные данные'!G65","v":0},{"$f":"VLOOKUP($J11,Base!$A:$I,2,FALSE)","v":{"$error":"#N/A"}},"ООО ''ОБО Беттерманн'', г.Липецк",{"$f":"VLOOKUP($J11,Base!$A:$I,4,FALSE)","v":{"$error":"#N/A"}},{"$f":"'Исходные данные'!H65","v":"---"},{"$f":"VLOOKUP($J11,Base!$A:$I,5,FALSE)","v":{"$error":"#N/A"}},{"$f":"VLOOKUP($J11,Base!$A:$I,6,FALSE)","v":{"$error":"#N/A"}}]
[{"$error":"#N/A"},{"$error":"#N/A"},{"$error":"#N/A"},"---",{"$error":"#N/A"},{"$error":"#N/A"},null,{"$f":"VLOOKUP($J12,Base!$A:$I,7,FALSE)","v":{"$error":"#N/A"}},{"$f":"VLOOKUP($J12,Base!$A:$I,3,FALSE)","v":{"$error":"#N/A"}},{"$f":"'Исходные данные'!G66","v":0},{"$f":"VLOOKUP($J12,Base!$A:$I,2,FALSE)","v":{"$error":"#N/A"}},"ООО ''ОБО Беттерманн'', г.Липецк",{"$f":"VLOOKUP($J12,Base!$A:$I,4,FALSE)","v":{"$error":"#N/A"}},{"$f":"'Исходные данные'!H66","v":"---"},{"$f":"VLOOKUP($J12,Base!$A:$I,5,FALSE)","v":{"$error":"#N/A"}},{"$f":"VLOOKUP($J12,Base!$A:$I,6,FALSE)","v":{"$error":"#N/A"}}]
[{"$error":"#N/A"},{"$error":"#N/A"},{"$error":"#N/A"},"---",{"$error":"#N/A"},{"$error":"#N/A"},null,{"$f":"VLOOKUP($J13,Base!$A:$I,7,FALSE)","v":{"$error":"#N/A"}},{"$f":"VLOOKUP($J13,Base!$A:$I,3,FALSE)","v":{"$error":"#N/A"}},{"$f":"'Исходные данные'!G67","v":0},{"$f":"VLOOKUP($J13,Base!$A:$I,2,FALSE)","v":{"$error":"#N/A"}},"ООО ''ОБО Беттерманн'', г.Липецк",{"$f":"VLOOKUP($J13,Base!$A:$I,4,FALSE)","v":{"$error":"#N/A"}},{"$f":"'Исходные данные'!H67","v":"---"},{"$f":"VLOOKUP($J13,Base!$A:$I,5,FALSE)","v":{"$error":"#N/A"}},{"$f":"VLOOKUP($J13,Base!$A:$I,6,FALSE)","v":{"$error":"#N/A"}}]
[{"$error":"#N/A"},{"$error":"#N/A"},{"$error":"#N/A"},"---",{"$error":"#N/A"},{"$error":"#N/A"},null,{"$f":"VLOOKUP($J14,Base!$A:$I,7,FALSE)","v":{"$error":"#N/A"}},{"$f":"VLOOKUP($J14,Base!$A:$I,3,FALSE)","v":{"$error":"#N/A"}},{"$f":"'Исходные данные'!G68","v":0},{"$f":"VLOOKUP($J14,Base!$A:$I,2,FALSE)","v":{"$error":"#N/A"}},"ООО ''ОБО Беттерманн'', г.Липецк",{"$f":"VLOOKUP($J14,Base!$A:$I,4,FALSE)","v":{"$error":"#N/A"}},{"$f":"'Исходные данные'!H68","v":"---"},{"$f":"VLOOKUP($J14,Base!$A:$I,5,FALSE)","v":{"$error":"#N/A"}},{"$f":"VLOOKUP($J14,Base!$A:$I,6,FALSE)","v":{"$error":"#N/A"}}]
[{"$error":"#N/A"},{"$error":"#N/A"},{"$error":"#N/A"},"---",{"$error":"#N/A"},{"$error":"#N/A"},null,{"$f":"VLOOKUP($J15,Base!$A:$I,7,FALSE)","v":{"$error":"#N/A"}},{"$f":"VLOOKUP($J15,Base!$A:$I,3,FALSE)","v":{"$error":"#N/A"}},{"$f":"'Исходные данные'!G69","v":0},{"$f":"VLOOKUP($J15,Base!$A:$I,2,FALSE)","v":{"$error":"#N/A"}},"ООО ''ОБО Беттерманн'', г.Липецк",{"$f":"VLOOKUP($J15,Base!$A:$I,4,FALSE)","v":{"$error":"#N/A"}},{"$f":"'Исходные данные'!H69","v":"---"},{"$f":"VLOOKUP($J15,Base!$A:$I,5,FALSE)","v":{"$error":"#N/A"}},{"$f":"VLOOKUP($J15,Base!$A:$I,6,FALSE)","v":{"$error":"#N/A"}}]
[{"$error":"#N/A"},{"$error":"#N/A"},{"$error":"#N/A"},"---",{"$error":"#N/A"},{"$error":"#N/A"},null,{"$f":"VLOOKUP($J16,Base!$A:$I,7,FALSE)","v":{"$error":"#N/A"}},{"$f":"VLOOKUP($J16,Base!$A:$I,3,FALSE)","v":{"$error":"#N/A"}},{"$f":"'Исходные данные'!G70","v":0},{"$f":"VLOOKUP($J16,Base!$A:$I,2,FALSE)","v":{"$error":"#N/A"}},"ООО ''ОБО Беттерманн'', г.Липецк",{"$f":"VLOOKUP($J16,Base!$A:$I,4,FALSE)","v":{"$error":"#N/A"}},{"$f":"'Исходные данные'!H70","v":"---"},{"$f":"VLOOKUP($J16,Base!$A:$I,5,FALSE)","v":{"$error":"#N/A"}},{"$f":"VLOOKUP($J16,Base!$A:$I,6,FALSE)","v":{"$error":"#N/A"}}]
[{"$error":"#N/A"},{"$error":"#N/A"},{"$error":"#N/A"},"---",{"$error":"#N/A"},{"$error":"#N/A"},null,{"$f":"VLOOKUP($J17,Base!$A:$I,7,FALSE)","v":{"$error":"#N/A"}},{"$f":"VLOOKUP($J17,Base!$A:$I,3,FALSE)","v":{"$error":"#N/A"}},{"$f":"'Исходные данные'!G71","v":0},{"$f":"VLOOKUP($J17,Base!$A:$I,2,FALSE)","v":{"$error":"#N/A"}},"ООО ''ОБО Беттерманн'', г.Липецк",{"$f":"VLOOKUP($J17,Base!$A:$I,4,FALSE)","v":{"$error":"#N/A"}},{"$f":"'Исходные данные'!H71","v":"---"},{"$f":"VLOOKUP($J17,Base!$A:$I,5,FALSE)","v":{"$error":"#N/A"}},{"$f":"VLOOKUP($J17,Base!$A:$I,6,FALSE)","v":{"$error":"#N/A"}}]
[{"$error":"#N/A"},{"$error":"#N/A"},{"$error":"#N/A"},0,{"$error":"#N/A"},{"$error":"#N/A"},null,{"$f":"VLOOKUP($J18,Base!$A:$I,7,FALSE)","v":{"$error":"#N/A"}},{"$f":"VLOOKUP($J18,Base!$A:$I,3,FALSE)","v":{"$error":"#N/A"}},{"$f":"'Исходные данные'!G72","v":0},{"$f":"VLOOKUP($J18,Base!$A:$I,2,FALSE)","v":{"$error":"#N/A"}},"ООО ''ОБО Беттерманн'', г.Липецк",{"$f":"VLOOKUP($J18,Base!$A:$I,4,FALSE)","v":{"$error":"#N/A"}},{"$f":"'Исходные данные'!H72","v":0},{"$f":"VLOOKUP($J18,Base!$A:$I,5,FALSE)","v":{"$error":"#N/A"}},{"$f":"VLOOKUP($J18,Base!$A:$I,6,FALSE)","v":{"$error":"#N/A"}}]
[{"$error":"#N/A"},{"$error":"#N/A"},{"$error":"#N/A"},"---",{"$error":"#N/A"},{"$error":"#N/A"},null,{"$f":"VLOOKUP($J19,Base!$A:$I,7,FALSE)","v":{"$error":"#N/A"}},{"$f":"VLOOKUP($J19,Base!$A:$I,3,FALSE)","v":{"$error":"#N/A"}},{"$f":"'Исходные данные'!G73","v":0},{"$f":"VLOOKUP($J19,Base!$A:$I,2,FALSE)","v":{"$error":"#N/A"}},"ООО ''ОБО Беттерманн'', г.Липецк",{"$f":"VLOOKUP($J19,Base!$A:$I,4,FALSE)","v":{"$error":"#N/A"}},{"$f":"'Исходные данные'!H73","v":"---"},{"$f":"VLOOKUP($J19,Base!$A:$I,5,FALSE)","v":{"$error":"#N/A"}},{"$f":"VLOOKUP($J19,Base!$A:$I,6,FALSE)","v":{"$error":"#N/A"}}]

{"sheet":"Спец. на лист","index":4,"n_rows":300,"n_cols":8,"rows_kept":300,"cut":false,"hidden":false,"merged":[[0,1,0,7],[1,1,1,7]]}
[null,"СПЕЦИФИКАЦИЯ НА ЛИСТ ЧЕРТЕЖА"]
[null,"(по форме 7 ГОСТ Р 21.101-2020)"]
[]
[null,"№ п/п","№","Обозначение","Наименование","Кол-во","Масса","Примечание"]
[null,1]
[null,{"$f":"IF(B5<COUNTA($E$5:$E$2000),B5+1,\"\")","v":""}]
[null,{"$f":"IF(B6<COUNTA($E$5:$E$2000),B6+1,\"\")","v":""}]
[null,""]
[null,""]
[null,""]
[null,""]
[null,""]
[null,""]
[null,""]
[null,""]
[null,""]
[null,""]
[null,""]
[null,""]
[null,""]
[null,""]
[null,""]
[null,""]
[null,""]
[null,""]
[null,""]
[null,""]
[null,""]
[null,""]
[null,""]
[null,""]
[null,""]
[null,""]
[null,""]
[null,""]
[null,""]
[null,""]
[null,""]
[null,""]
[null,""]
[null,""]
[null,""]
[null,""]
[null,""]
[null,""]
[null,""]
[null,""]
[null,""]
[null,""]
[null,""]
[null,""]
[null,""]
[null,""]
[null,""]
[null,""]
[null,""]
[null,""]
[null,""]
[null,""]
[null,""]
[null,""]
[null,""]
[null,""]
[null,""]
[null,""]
[null,""]
[null,""]
[null,""]
[null,""]
[null,""]
[null,{"$f":"IF(B70<COUNTA($E$5:$E$2000),B70+1,\"\")","v":""}]
[null,""]
[null,""]
[null,""]
[null,""]
[null,""]
[null,""]
[null,""]
[null,""]
[null,""]
[null,""]
[null,""]
[null,""]
[null,""]
[null,""]
[null,""]
[null,""]
[null,""]
[null,""]
[null,""]
[null,""]
[null,""]
[null,""]
[null,""]
[null,""]
[null,""]
[null,""]
[null,""]
[null,""]
[null,""]
[null,""]
[null,""]
[null,""]
[null,""]
[null,""]
[null,""]
[null,""]
[null,""]
[null,""]
[null,""]
[null,""]
[null,""]
[null,""]
[null,""]
[null,""]
[null,""]
[null,""]
[null,""]
[null,""]
[null,""]
[null,""]
[null,""]
[null,""]
[null,""]
[null,""]
[null,""]
[null,""]
[null,""]
[null,""]
[null,""]
[null,""]
[null,""]
[null,""]
[null,""]
[null,{"$f":"IF(B134<COUNTA($E$5:$E$2000),B134+1,\"\")","v":""}]
[null,""]
[null,""]
[null,""]
[null,""]
[null,""]
[null,""]
[null,""]
[null,""]
[null,""]
[null,""]
[null,""]
[null,""]
[null,""]
[null,""]
[null,""]
[null,""]
[null,""]
[null,""]
[null,""]
[null,""]
[null,""]
[null,""]
[null,""]
[null,""]
[null,""]
[null,""]
[null,""]
[null,""]
[null,""]
[null,""]
[null,""]
[null,""]
[null,""]
[null,""]
[null,""]
[null,""]
[null,""]
[null,""]
[null,""]
[null,""]
[null,""]
[null,""]
[null,""]
[null,""]
[null,""]
[null,""]
[null,""]
[null,""]
[null,""]
[null,""]
[null,""]
[null,""]
[null,""]
[null,""]
[null,""]
[null,""]
[null,""]
[null,""]
[null,""]
[null,""]
[null,""]
[null,""]
[null,""]
[null,{"$f":"IF(B198<COUNTA($E$5:$E$2000),B198+1,\"\")","v":""}]
[null,""]
[null,""]
[null,""]
[null,""]
[null,""]
[null,""]
[null,""]
[null,""]
[null,""]
[null,""]
[null,""]
[null,""]
[null,""]
[null,""]
[null,""]
[null,""]
[null,""]
[null,""]
[null,""]
[null,""]
[null,""]
[null,""]
[null,""]
[null,""]
[null,""]
[null,""]
[null,""]
[null,""]
[null,""]
[null,""]
[null,""]
[null,""]
[null,""]
[null,""]
[null,""]
[null,""]
[null,""]
[null,""]
[null,""]
[null,""]
[null,""]
[null,""]
[null,""]
[null,""]
[null,""]
[null,""]
[null,""]
[null,""]
[null,""]
[null,""]
[null,""]
[null,""]
[null,""]
[null,""]
[null,""]
[null,""]
[null,""]
[null,""]
[null,""]
[null,""]
[null,""]
[null,""]
[null,""]
[null,{"$f":"IF(B262<COUNTA($E$5:$E$2000),B262+1,\"\")","v":""}]
[null,""]
[null,""]
[null,""]
[null,""]
[null,""]
[null,""]
[null,""]
[null,""]
[null,""]
[null,""]
[null,""]
[null,""]
[null,""]
[null,""]
[null,""]
[null,""]
[null,""]
[null,""]
[null,""]
[null,""]
[null,""]
[null,""]
[null,""]
[null,""]
[null,""]
[null,""]
[null,""]
[null,""]
[null,""]
[null,""]
[null,""]
[null,""]
[null,""]
[null,""]
[null,""]
[null,""]
[null,""]

{"sheet":"Спец. обор. изд. и мат.","index":5,"n_rows":300,"n_cols":11,"rows_kept":300,"cut":false,"hidden":false,"merged":[[0,1,0,10],[1,1,1,10]]}
[null,"СПЕЦИФИКАЦИЯ ОБОРУДОВАНИЯ, ИЗДЕЛИЙ И МАТЕРИАЛОВ"]
[null,"(по форме 1 ГОСТ Р 21.110-2013)"]
[]
[null,"№ п/п","№","Наименование","Тип","Артикул","Поставщик","Ед.изм.","Кол-во","Масса","Примечание"]
[null,1]
[null,{"$f":"IF(B5<COUNTA($E$5:$E$2000),B5+1,\"\")","v":""}]
[null,{"$f":"IF(B6<COUNTA($E$5:$E$2000),B6+1,\"\")","v":""}]
[null,""]
[null,""]
[null,""]
[null,""]
[null,""]
[null,""]
[null,""]
[null,""]
[null,""]
[null,""]
[null,""]
[null,""]
[null,""]
[null,""]
[null,""]
[null,""]
[null,""]
[null,""]
[null,""]
[null,""]
[null,""]
[null,""]
[null,""]
[null,""]
[null,""]
[null,""]
[null,""]
[null,""]
[null,""]
[null,""]
[null,""]
[null,""]
[null,""]
[null,""]
[null,""]
[null,""]
[null,""]
[null,""]
[null,""]
[null,""]
[null,""]
[null,""]
[null,""]
[null,""]
[null,""]
[null,""]
[null,""]
[null,""]
[null,""]
[null,""]
[null,""]
[null,""]
[null,""]
[null,""]
[null,""]
[null,""]
[null,""]
[null,""]
[null,""]
[null,""]
[null,""]
[null,""]
[null,""]
[null,{"$f":"IF(B70<COUNTA($E$5:$E$2000),B70+1,\"\")","v":""}]
[null,""]
[null,""]
[null,""]
[null,""]
[null,""]
[null,""]
[null,""]
[null,""]
[null,""]
[null,""]
[null,""]
[null,""]
[null,""]
[null,""]
[null,""]
[null,""]
[null,""]
[null,""]
[null,""]
[null,""]
[null,""]
[null,""]
[null,""]
[null,""]
[null,""]
[null,""]
[null,""]
[null,""]
[null,""]
[null,""]
[null,""]
[null,""]
[null,""]
[null,""]
[null,""]
[null,""]
[null,""]
[null,""]
[null,""]
[null,""]
[null,""]
[null,""]
[null,""]
[null,""]
[null,""]
[null,""]
[null,""]
[null,""]
[null,""]
[null,""]
[null,""]
[null,""]
[null,""]
[null,""]
[null,""]
[null,""]
[null,""]
[null,""]
[null,""]
[null,""]
[null,""]
[null,""]
[null,""]
[null,{"$f":"IF(B134<COUNTA($E$5:$E$2000),B134+1,\"\")","v":""}]
[null,""]
[null,""]
[null,""]
[null,""]
[null,""]
[null,""]
[null,""]
[null,""]
[null,""]
[null,""]
[null,""]
[null,""]
[null,""]
[null,""]
[null,""]
[null,""]
[null,""]
[null,""]
[null,""]
[null,""]
[null,""]
[null,""]
[null,""]
[null,""]
[null,""]
[null,""]
[null,""]
[null,""]
[null,""]
[null,""]
[null,""]
[null,""]
[null,""]
[null,""]
[null,""]
[null,""]
[null,""]
[null,""]
[null,""]
[null,""]
[null,""]
[null,""]
[null,""]
[null,""]
[null,""]
[null,""]
[null,""]
[null,""]
[null,""]
[null,""]
[null,""]
[null,""]
[null,""]
[null,""]
[null,""]
[null,""]
[null,""]
[null,""]
[null,""]
[null,""]
[null,""]
[null,""]
[null,""]
[null,{"$f":"IF(B198<COUNTA($E$5:$E$2000),B198+1,\"\")","v":""}]
[null,""]
[null,""]
[null,""]
[null,""]
[null,""]
[null,""]
[null,""]
[null,""]
[null,""]
[null,""]
[null,""]
[null,""]
[null,""]
[null,""]
[null,""]
[null,""]
[null,""]
[null,""]
[null,""]
[null,""]
[null,""]
[null,""]
[null,""]
[null,""]
[null,""]
[null,""]
[null,""]
[null,""]
[null,""]
[null,""]
[null,""]
[null,""]
[null,""]
[null,""]
[null,""]
[null,""]
[null,""]
[null,""]
[null,""]
[null,""]
[null,""]
[null,""]
[null,""]
[null,""]
[null,""]
[null,""]
[null,""]
[null,""]
[null,""]
[null,""]
[null,""]
[null,""]
[null,""]
[null,""]
[null,""]
[null,""]
[null,""]
[null,""]
[null,""]
[null,""]
[null,""]
[null,""]
[null,""]
[null,{"$f":"IF(B262<COUNTA($E$5:$E$2000),B262+1,\"\")","v":""}]
[null,""]
[null,""]
[null,""]
[null,""]
[null,""]
[null,""]
[null,""]
[null,""]
[null,""]
[null,""]
[null,""]
[null,""]
[null,""]
[null,""]
[null,""]
[null,""]
[null,""]
[null,""]
[null,""]
[null,""]
[null,""]
[null,""]
[null,""]
[null,""]
[null,""]
[null,""]
[null,""]
[null,""]
[null,""]
[null,""]
[null,""]
[null,""]
[null,""]
[null,""]
[null,""]
[null,""]
[null,""]