{"text_format":"1","workbook":"xlsx","n_sheets":6,"sheets":["Base","BL","Исходные данные","SS2","Спец. на лист","Спец. обор. изд. и мат."],"not_rendered":{"charts":0,"images":2,"macros":1,"external_links":0,"defined_names":1,"comments":1,"pivot_tables":4},"unopened":[],"bounds":{"document_bytes":16777216,"sheet_cells":100000,"rows_first":2000,"rows_last":500,"rows_between":2000,"halvings":0,"cell_chars":16384,"cell_head_chars":4096},"cells_cut":0,"cells_raw":0,"read":"whole","date_system":"1900"}

{"sheet":"Base","index":0,"n_rows":109,"n_cols":10,"rows_kept":109,"cut":false,"hidden":true,"merged":[]}
["Тип","Артикул","Наименование","Ед.изм.","Масса","Примечание","№ п/п","Кратн.","Снят","OboBettermann"]
["KSR20020",6249842,"Кольцо для защиты кромок LKM 20x20 мм, серый","шт.",8.9999999999999993E-3,"   ",8,1,"Нет"]
["KSR20030",6249844,"Кольцо для защиты кромок LKM 20x30 мм, серый","шт.",1.0999999999999999E-2,"   ",8,1,"Нет"]
["KSR30030",6249847,"Кольцо для защиты кромок LKM 30x30 мм, серый","шт.",1.2999999999999999E-2,"   ",8,1,"Нет"]
["KSR40040",6249846,"Кольцо для защиты кромок LKM 40x40 мм, серый","шт.",1.7999999999999999E-2,"   ",8,1,"Нет"]
["KSR40060",6249848,"Кольцо для защиты кромок LKM 40x60 мм, серый","шт.",2.3E-2,"   ",8,1,"Нет"]
["KSR60060",6249850,"Кольцо для защиты кромок LKM 60x60 мм, серый","шт.",2.4E-2,"   ",8,1,"Нет"]
["KSR60100",6249852,"Кольцо для защиты кромок LKM 60x100 мм, серый","шт.",3.4000000000000002E-2,"   ",8,1,"Нет"]
["KSR60150",6249854,"Кольцо для защиты кромок LKM 60x150 мм, серый","шт.",4.3999999999999997E-2,"   ",8,1,"Нет"]
["KSR60200",6249856,"Кольцо для защиты кромок LKM 60x200 мм, серый","шт.",4.7E-2,"   ",8,1,"Нет"]
{"$rows_left_out":100}
{"sheet":"BL","index":1,"n_rows":26,"n_cols":76,"rows_kept":26,"cut":false,"hidden":true,"merged":[[0,56,0,59],[0,40,0,43],[0,52,0,55],[0,64,0,67],[0,0,0,7],[0,72,0,75],[0,12,0,15],[0,24,0,27],[0,36,0,39],[0,48,0,51],[0,8,0,11],[0,68,0,71],[0,16,0,19],[0,28,0,31],[0,60,0,63],[0,20,0,23],[0,32,0,35],[0,44,0,47]]}
["Короб",null,null,null,null,null,null,null,"Стыковой соединитель",null,null,null,"Крепеж короба",null,null,null,"Внутренний угол",null,null,null,"Стык. соед. внутреннего угла",null,null,null,"Крепеж внутреннего угла",null,null,null,"Внешний угол",null,null,null,"Стык. соед. внешнего угла",null,null,null,"Крепеж внешнего угла",null,null,null,"Т-образная секция",null,null,null,"Стык. соед. Т-образной секции",null,null,null,"Крепеж Т-образной секции",null,null,null,"Плоский угол",null,null,null,"Стык. соед. плоского угла",null,null,null,"Крепеж плоского угла",null,null,null,"Заглушка",null,null,null,"Кольцо для защиты кромок",null,null,null,"Перегородка"]
["Тип","Артикул","Ед.изм.","Кол-во\nна 1 эл.","Сечение","Глубина\n(борт)","Высота\n(дно)","Цвет","Тип","Артикул","Ед.изм.","Кол-во\nна 1 эл.","Тип","Артикул","Ед.изм.","Кол-во\nна 1 эл.","Тип","Артикул","Ед.изм.","Кол-во\nна 1 эл.","Тип","Артикул","Ед.изм.","Кол-во\nна 1 эл.","Тип","Артикул","Ед.изм.","Кол-во\nна 1 эл.","Тип","Артикул","Ед.изм.","Кол-во\nна 1 эл.","Тип","Артикул","Ед.изм.","Кол-во\nна 1 эл.","Тип","Артикул","Ед.изм.","Кол-во\nна 1 эл.","Тип","Артикул","Ед.изм.","Кол-во\nна 1 эл.","Тип","Артикул","Ед.изм.","Кол-во\nна 1 эл.","Тип","Артикул","Ед.изм.","Кол-во\nна 1 эл.","Тип","Артикул","Ед.изм.","Кол-во\nна 1 эл.","Тип","Артикул","Ед.изм.","Кол-во\nна 1 эл.","Тип","Артикул","Ед.изм.","Кол-во\nна 1 эл.","Тип","Артикул","Ед.изм.","Кол-во\nна 1 эл.","Тип","Артикул","Ед.изм.","Кол-во\nна 1 эл.","Тип","Артикул","Ед.изм.","Кол-во\nна 1 эл."]
["---","---","---",null,"---","---","---","---","---","---","---","---","---","---","---","---","---","---","---","---","---","---","---","---","---","---","---","---","---","---","---","---","---","---","---","---","---","---","---","---","---","---","---","---","---","---","---","---","---","---","---","---","---","---","---","---","---","---","---","---","---","---","---","---","---","---","---","---","---","---","---","---","---","---","---","---"]
["LKM20020FS",{"$f":"VLOOKUP(A4,Base!$A:$I,2,FALSE)","v":6246966},{"$f":"VLOOKUP(A4,Base!$A:$I,4,FALSE)","v":"м"},2,"20х20",20,20,"Сталь",{"$f":"CONCATENATE(\"LKM SV\",$G4)","v":"LKM SV20"},{"$f":"VLOOKUP(I4,Base!$A:$I,2,FALSE)","v":6247431},{"$f":"VLOOKUP(I4,Base!$A:$I,4,FALSE)","v":"шт."},{"$f":"IF(F4<40,1,2)","v":1},"910 SD 6x40",{"$f":"VLOOKUP(M4,Base!$A:$I,2,FALSE)","v":2351064},{"$f":"VLOOKUP(M4,Base!$A:$I,4,FALSE)","v":"шт."},6,"---","---","---","---","---","---","---","---","---","---","---","---","---","---","---","---","---","---","---","---","---","---","---","---","---","---","---","---","---","---","---","---","---","---","---","---","---","---","---","---","---","---","---","---","---","---","---","---","---","---","---","---",{"$f":"CONCATENATE(\"KSR\",$F4,IF($G4<100,\"0\",\"\"),$G4)","v":"KSR20020"},{"$f":"VLOOKUP(BQ4,Base!$A:$I,2,FALSE)","v":6249842},{"$f":"VLOOKUP(BQ4,Base!$A:$I,4,FALSE)","v":"шт."},1,"---","---","---","---"]
["LKM20020RW",{"$f":"VLOOKUP(A5,Base!$A:$I,2,FALSE)","v":6248462},{"$f":"VLOOKUP(A5,Base!$A:$I,4,FALSE)","v":"м"},2,"20х20",20,20,"Белый","LKM SV20",{"$f":"VLOOKUP(I5,Base!$A:$I,2,FALSE)","v":6247431},{"$f":"VLOOKUP(I5,Base!$A:$I,4,FALSE)","v":"шт."},1,"910 SD 6x40",{"$f":"VLOOKUP(M5,Base!$A:$I,2,FALSE)","v":2351064},{"$f":"VLOOKUP(M5,Base!$A:$I,4,FALSE)","v":"шт."},6,"---","---","---","---","---","---","---","---","---","---","---","---","---","---","---","---","---","---","---","---","---","---","---","---","---","---","---","---","---","---","---","---","---","---","---","---","---","---","---","---","---","---","---","---","---","---","---","---","---","---","---","---","KSR20020",{"$f":"VLOOKUP(BQ5,Base!$A:$I,2,FALSE)","v":6249842},{"$f":"VLOOKUP(BQ5,Base!$A:$I,4,FALSE)","v":"шт."},1,"---","---","---","---"]
["LKM20030FS",{"$f":"VLOOKUP(A6,Base!$A:$I,2,FALSE)","v":6246974},{"$f":"VLOOKUP(A6,Base!$A:$I,4,FALSE)","v":"м"},2,"20х30",20,30,"Сталь","LKM SV30",{"$f":"VLOOKUP(I6,Base!$A:$I,2,FALSE)","v":6247434},{"$f":"VLOOKUP(I6,Base!$A:$I,4,FALSE)","v":"шт."},1,"910 SD 6x40",{"$f":"VLOOKUP(M6,Base!$A:$I,2,FALSE)","v":2351064},{"$f":"VLOOKUP(M6,Base!$A:$I,4,FALSE)","v":"шт."},6,"---","---","---","---","---","---","---","---","---","---","---","---","---","---","---","---","---","---","---","---","---","---","---","---","---","---","---","---","---","---","---","---","---","---","---","---","---","---","---","---","---","---","---","---","---","---","---","---","---","---","---","---","KSR20030",{"$f":"VLOOKUP(BQ6,Base!$A:$I,2,FALSE)","v":6249844},{"$f":"VLOOKUP(BQ6,Base!$A:$I,4,FALSE)","v":"шт."},1,"---","---","---","---"]
["LKM20030RW",{"$f":"VLOOKUP(A7,Base!$A:$I,2,FALSE)","v":6248470},{"$f":"VLOOKUP(A7,Base!$A:$I,4,FALSE)","v":"м"},2,"20х30",20,30,"Белый","LKM SV30",{"$f":"VLOOKUP(I7,Base!$A:$I,2,FALSE)","v":6247434},{"$f":"VLOOKUP(I7,Base!$A:$I,4,FALSE)","v":"шт."},1,"910 SD 6x40",{"$f":"VLOOKUP(M7,Base!$A:$I,2,FALSE)","v":2351064},{"$f":"VLOOKUP(M7,Base!$A:$I,4,FALSE)","v":"шт."},6,"---","---","---","---","---","---","---","---","---","---","---","---","---","---","---","---","---","---","---","---","---","---","---","---","---","---","---","---","---","---","---","---","---","---","---","---","---","---","---","---","---","---","---","---","---","---","---","---","---","---","---","---","KSR20030",{"$f":"VLOOKUP(BQ7,Base!$A:$I,2,FALSE)","v":6249844},{"$f":"VLOOKUP(BQ7,Base!$A:$I,4,FALSE)","v":"шт."},1,"---","---","---","---"]
["LKM30030FS",{"$f":"VLOOKUP(A8,Base!$A:$I,2,FALSE)","v":6246985},{"$f":"VLOOKUP(A8,Base!$A:$I,4,FALSE)","v":"м"},2,"30х30",30,30,"Сталь","LKM SV30",{"$f":"VLOOKUP(I8,Base!$A:$I,2,FALSE)","v":6247434},{"$f":"VLOOKUP(I8,Base!$A:$I,4,FALSE)","v":"шт."},1,"910 SD 6x40",{"$f":"VLOOKUP(M8,Base!$A:$I,2,FALSE)","v":2351064},{"$f":"VLOOKUP(M8,Base!$A:$I,4,FALSE)","v":"шт."},6,"---","---","---","---","---","---","---","---","---","---","---","---","---","---","---","---","---","---","---","---","---","---","---","---","---","---","---","---","---","---","---","---","---","---","---","---","---","---","---","---","---","---","---","---","---","---","---","---","---","---","---","---","KSR30030",{"$f":"VLOOKUP(BQ8,Base!$A:$I,2,FALSE)","v":6249847},{"$f":"VLOOKUP(BQ8,Base!$A:$I,4,FALSE)","v":"шт."},1,"---","---","---","---"]
["LKM30030RW",{"$f":"VLOOKUP(A9,Base!$A:$I,2,FALSE)","v":6248489},{"$f":"VLOOKUP(A9,Base!$A:$I,4,FALSE)","v":"м"},2,"30х30",30,30,"Белый","LKM SV30",{"$f":"VLOOKUP(I9,Base!$A:$I,2,FALSE)","v":6247434},{"$f":"VLOOKUP(I9,Base!$A:$I,4,FALSE)","v":"шт."},1,"910 SD 6x40",{"$f":"VLOOKUP(M9,Base!$A:$I,2,FALSE)","v":2351064},{"$f":"VLOOKUP(M9,Base!$A:$I,4,FALSE)","v":"шт."},6,"---","---","---","---","---","---","---","---","---","---","---","---","---","---","---","---","---","---","---","---","---","---","---","---","---","---","---","---","---","---","---","---","---","---","---","---","---","---","---","---","---","---","---","---","---","---","---","---","---","---","---","---","KSR30030",{"$f":"VLOOKUP(BQ9,Base!$A:$I,2,FALSE)","v":6249847},{"$f":"VLOOKUP(BQ9,Base!$A:$I,4,FALSE)","v":"шт."},1,"---","---","---","---"]
["LKM40040FS",{"$f":"VLOOKUP(A10,Base!$A:$I,2,FALSE)","v":6246990},{"$f":"VLOOKUP(A10,Base!$A:$I,4,FALSE)","v":"м"},2,"40х40",40,40,"Сталь",{"$f":"CONCATENATE(\"LKM SV\",$F10)","v":"LKM SV40"},{"$f":"VLOOKUP(I10,Base!$A:$I,2,FALSE)","v":6247458},{"$f":"VLOOKUP(I10,Base!$A:$I,4,FALSE)","v":"шт."},2,"910 SD 6x40",{"$f":"VLOOKUP(M10,Base!$A:$I,2,FALSE)","v":2351064},{"$f":"VLOOKUP(M10,Base!$A:$I,4,FALSE)","v":"шт."},6,{"$f":"CONCATENATE(\"LKM I\",$F10,IF($G10<100,\"0\",\"\"),$G10,IF(H10=\"Сталь\",\"FS\",\"RW\"))","v":"LKM I40040FS"},{"$f":"VLOOKUP(Q10,Base!$A:$I,2,FALSE)","v":6247652},{"$f":"VLOOKUP(Q10,Base!$A:$I,4,FALSE)","v":"шт."},1,{"$f":"CONCATENATE(\"LKM SV\",$F10)","v":"LKM SV40"},{"$f":"VLOOKUP(U10,Base!$A:$I,2,FALSE)","v":6247458},{"$f":"VLOOKUP(U10,Base!$A:$I,4,FALSE)","v":"шт."},4,"910 SD 6x40",{"$f":"VLOOKUP(Y10,Base!$A:$I,2,FALSE)","v":2351064},{"$f":"VLOOKUP(Y10,Base!$A:$I,4,FALSE)","v":"шт."},2,{"$f":"CONCATENATE(\"LKM A\",$F10,IF($G10<100,\"0\",\"\"),$G10,IF(I10=\"Сталь\",\"FS\",\"RW\"))","v":"LKM A40040RW"},{"$f":"VLOOKUP(AC10,Base!$A:$I,2,FALSE)","v":6249086},{"$f":"VLOOKUP(AC10,Base!$A:$I,4,FALSE)","v":"шт."},1,{"$f":"CONCATENATE(\"LKM SV\",$F10)","v":"LKM SV40"},{"$f":"VLOOKUP(AG10,Base!$A:$I,2,FALSE)","v":6247458},{"$f":"VLOOKUP(AG10,Base!$A:$I,4,FALSE)","v":"шт."},4,"910 SD 6x40",{"$f":"VLOOKUP(AK10,Base!$A:$I,2,FALSE)","v":2351064},{"$f":"VLOOKUP(AK10,Base!$A:$I,4,FALSE)","v":"шт."},2,{"$f":"CONCATENATE(\"LKM T\",$F10,IF($G10<100,\"0\",\"\"),$G10,IF(BQ10=\"Сталь\",\"FS\",\"RW\"))","v":"LKM T40040RW"},{"$f":"VLOOKUP(AO10,Base!$A:$I,2,FALSE)","v":6249256},{"$f":"VLOOKUP(AO10,Base!$A:$I,4,FALSE)","v":"шт."},1,{"$f":"CONCATENATE(\"LKM SV\",$F10)","v":"LKM SV40"},{"$f":"VLOOKUP(AS10,Base!$A:$I,2,FALSE)","v":6247458},{"$f":"VLOOKUP(AS10,Base!$A:$I,4,FALSE)","v":"шт."},6,"910 SD 6x40",{"$f":"VLOOKUP(AW10,Base!$A:$I,2,FALSE)","v":2351064},{"$f":"VLOOKUP(AW10,Base!$A:$I,4,FALSE)","v":"шт."},3,{"$f":"CONCATENATE(\"LKM F\",$F10,IF($G10<100,\"0\",\"\"),$G10,IF(Q10=\"Сталь\",\"FS\",\"RW\"))","v":"LKM F40040RW"},{"$f":"VLOOKUP(BA10,Base!$A:$I,2,FALSE)","v":6248993},{"$f":"VLOOKUP(BA10,Base!$A:$I,4,FALSE)","v":"шт."},1,{"$f":"CONCATENATE(\"LKM SV\",$F10)","v":"LKM SV40"},{"$f":"VLOOKUP(BE10,Base!$A:$I,2,FALSE)","v":6247458},{"$f":"VLOOKUP(BE10,Base!$A:$I,4,FALSE)","v":"шт."},4,"910 SD 6x40",{"$f":"VLOOKUP(BI10,Base!$A:$I,2,FALSE)","v":2351064},{"$f":"VLOOKUP(BI10,Base!$A:$I,4,FALSE)","v":"шт."},2,{"$f":"CONCATENATE(\"LKM E\",$F10,IF($G10<100,\"0\",\"\"),$G10,IF(AC10=\"Сталь\",\"FS\",\"RW\"))","v":"LKM E40040RW"},{"$f":"VLOOKUP(BM10,Base!$A:$I,2,FALSE)","v":6249418},{"$f":"VLOOKUP(BM10,Base!$A:$I,4,FALSE)","v":"шт."},1,"KSR40040",{"$f":"VLOOKUP(BQ10,Base!$A:$I,2,FALSE)","v":6249846},{"$f":"VLOOKUP(BQ10,Base!$A:$I,4,FALSE)","v":"шт."},1,"---","---","---","---"]
{"$rows_left_out":17}
{"sheet":"Исходные данные","index":2,"n_rows":73,"n_cols":9,"rows_kept":73,"cut":false,"hidden":false,"merged":[[10,5,10,6],[16,5,16,6],[1,0,1,21],[3,0,3,21],[4,0,4,21],[15,5,15,6]]}
[]
["КАЛЬКУЛЯТОР"]
[]
["РАСЧЕТА КАБЕЛЬНЫХ ТРАСС"]
["на основе металлических лотков серии LKM"]
[]
[]
[]
[]
[]
{"$rows_left_out":64}
{"sheet":"SS2","index":3,"n_rows":19,"n_cols":33,"rows_kept":19,"cut":false,"hidden":true,"merged":[]}
["№","Обозначение","Наименование","Кол-во","Масса","Примечание",null,"№","Наименование","Тип","Артикул","Поставщик","Ед.изм.","Кол-во","Масса","Примечание",null,"№","Обозначение","Наименование","Масса","Примечание","Сумма по полю Кол-во",null,"№","Наименование","Тип","Артикул","Поставщик","Ед.изм.","Масса","Примечание","Сумма по полю Кол-во"]
[{"$f":"H2","v":{"$error":"#N/A"}},{"$f":"CONCATENATE(J2, \" (арт. \",K2,\")\")","v":{"$error":"#N/A"}},{"$f":"I2","v":{"$error":"#N/A"}},{"$f":"N2","v":0},{"$f":"O2","v":{"$error":"#N/A"}},{"$f":"P2","v":{"$error":"#N/A"}},null,{"$f":"VLOOKUP($J2,Base!$A:$I,7,FALSE)","v":{"$error":"#N/A"}},{"$f":"VLOOKUP($J2,Base!$A:$I,3,FALSE)","v":{"$error":"#N/A"}},{"$f":"'Исходные данные'!G56","v":0},{"$f":"VLOOKUP($J2,Base!$A:$I,2,FALSE)","v":{"$error":"#N/A"}},"ООО ''ОБО Беттерманн'', г.Липецк",{"$f":"VLOOKUP($J2,Base!$A:$I,4,FALSE)","v":{"$error":"#N/A"}},{"$f":"'Исходные данные'!H56","v":0},{"$f":"VLOOKUP($J2,Base!$A:$I,5,FALSE)","v":{"$error":"#N/A"}},{"$f":"VLOOKUP($J2,Base!$A:$I,6,FALSE)","v":{"$error":"#N/A"}},null,"#Н/Д","#Н/Д","#Н/Д","#Н/Д","#Н/Д",0,null,"#Н/Д","#Н/Д",0,"#Н/Д","ООО ''ОБО Беттерманн'', г.Липецк","#Н/Д","#Н/Д","#Н/Д",0]
[{"$f":"H3","v":{"$error":"#N/A"}},{"$f":"CONCATENATE(J3, \" (арт. \",K3,\")\")","v":{"$error":"#N/A"}},{"$f":"I3","v":{"$error":"#N/A"}},{"$f":"N3","v":"---"},{"$f":"O3","v":{"$error":"#N/A"}},{"$f":"P3","v":{"$error":"#N/A"}},null,{"$f":"VLOOKUP($J3,Base!$A:$I,7,FALSE)","v":{"$error":"#N/A"}},{"$f":"VLOOKUP($J3,Base!$A:$I,3,FALSE)","v":{"$error":"#N/A"}},{"$f":"'Исходные данные'!G57","v":0},{"$f":"VLOOKUP($J3,Base!$A:$I,2,FALSE)","v":{"$error":"#N/A"}},"ООО ''ОБО Беттерманн'', г.Липецк",{"$f":"VLOOKUP($J3,Base!$A:$I,4,FALSE)","v":{"$error":"#N/A"}},{"$f":"'Исходные данные'!H57","v":"---"},{"$f":"VLOOKUP($J3,Base!$A:$I,5,FALSE)","v":{"$error":"#N/A"}},{"$f":"VLOOKUP($J3,Base!$A:$I,6,FALSE)","v":{"$error":"#N/A"}},null,"(пусто)","(пусто)","(пусто)","(пусто)","(пусто)",null,null,"(пусто)","(пусто)","(пусто)","(пусто)","(пусто)","(пусто)","(пусто)","(пусто)"]
[{"$error":"#N/A"},{"$error":"#N/A"},{"$error":"#N/A"},"---",{"$error":"#N/A"},{"$error":"#N/A"},null,{"$f":"VLOOKUP($J4,Base!$A:$I,7,FALSE)","v":{"$error":"#N/A"}},{"$f":"VLOOKUP($J4,Base!$A:$I,3,FALSE)","v":{"$error":"#N/A"}},{"$f":"'Исходные данные'!G58","v":0},{"$f":"VLOOKUP($J4,Base!$A:$I,2,FALSE)","v":{"$error":"#N/A"}},"ООО ''ОБО Беттерманн'', г.Липецк",{"$f":"VLOOKUP($J4,Base!$A:$I,4,FALSE)","v":{"$error":"#N/A"}},{"$f":"'Исходные данные'!H58","v":"---"},{"$f":"VLOOKUP($J4,Base!$A:$I,5,FALSE)","v":{"$error":"#N/A"}},{"$f":"VLOOKUP($J4,Base!$A:$I,6,FALSE)","v":{"$error":"#N/A"}},null,"Общий итог",null,null,null,null,0,null,"Общий итог",null,null,null,null,null,null,null,0]
[{"$error":"#N/A"},{"$error":"#N/A"},{"$error":"#N/A"},"---",{"$error":"#N/A"},{"$error":"#N/A"},null,{"$f":"VLOOKUP($J5,Base!$A:$I,7,FALSE)","v":{"$error":"#N/A"}},{"$f":"VLOOKUP($J5,Base!$A:$I,3,FALSE)","v":{"$error":"#N/A"}},{"$f":"'Исходные данные'!G59","v":0},{"$f":"VLOOKUP($J5,Base!$A:$I,2,FALSE)","v":{"$error":"#N/A"}},"ООО ''ОБО Беттерманн'', г.Липецк",{"$f":"VLOOKUP($J5,Base!$A:$I,4,FALSE)","v":{"$error":"#N/A"}},{"$f":"'Исходные данные'!H59","v":"---"},{"$f":"VLOOKUP($J5,Base!$A:$I,5,FALSE)","v":{"$error":"#N/A"}},{"$f":"VLOOKUP($J5,Base!$A:$I,6,FALSE)","v":{"$error":"#N/A"}}]
[{"$error":"#N/A"},{"$error":"#N/A"},{"$error":"#N/A"},"---",{"$error":"#N/A"},{"$error":"#N/A"},null,{"$f":"VLOOKUP($J6,Base!$A:$I,7,FALSE)","v":{"$error":"#N/A"}},{"$f":"VLOOKUP($J6,Base!$A:$I,3,FALSE)","v":{"$error":"#N/A"}},{"$f":"'Исходные данные'!G60","v":0},{"$f":"VLOOKUP($J6,Base!$A:$I,2,FALSE)","v":{"$error":"#N/A"}},"ООО ''ОБО Беттерманн'', г.Липецк",{"$f":"VLOOKUP($J6,Base!$A:$I,4,FALSE)","v":{"$error":"#N/A"}},{"$f":"'Исходные данные'!H60","v":"---"},{"$f":"VLOOKUP($J6,Base!$A:$I,5,FALSE)","v":{"$error":"#N/A"}},{"$f":"VLOOKUP($J6,Base!$A:$I,6,FALSE)","v":{"$error":"#N/A"}}]
[{"$error":"#N/A"},{"$error":"#N/A"},{"$error":"#N/A"},"---",{"$error":"#N/A"},{"$error":"#N/A"},null,{"$f":"VLOOKUP($J7,Base!$A:$I,7,FALSE)","v":{"$error":"#N/A"}},{"$f":"VLOOKUP($J7,Base!$A:$I,3,FALSE)","v":{"$error":"#N/A"}},{"$f":"'Исходные данные'!G61","v":0},{"$f":"VLOOKUP($J7,Base!$A:$I,2,FALSE)","v":{"$error":"#N/A"}},"ООО ''ОБО Беттерманн'', г.Липецк",{"$f":"VLOOKUP($J7,Base!$A:$I,4,FALSE)","v":{"$error":"#N/A"}},{"$f":"'Исходные данные'!H61","v":"---"},{"$f":"VLOOKUP($J7,Base!$A:$I,5,FALSE)","v":{"$error":"#N/A"}},{"$f":"VLOOKUP($J7,Base!$A:$I,6,FALSE)","v":{"$error":"#N/A"}}]
[{"$error":"#N/A"},{"$error":"#N/A"},{"$error":"#N/A"},"---",{"$error":"#N/A"},{"$error":"#N/A"},null,{"$f":"VLOOKUP($J8,Base!$A:$I,7,FALSE)","v":{"$error":"#N/A"}},{"$f":"VLOOKUP($J8,Base!$A:$I,3,FALSE)","v":{"$error":"#N/A"}},{"$f":"'Исходные данные'!G62","v":0},{"$f":"VLOOKUP($J8,Base!$A:$I,2,FALSE)","v":{"$error":"#N/A"}},"ООО ''ОБО Беттерманн'', г.Липецк",{"$f":"VLOOKUP($J8,Base!$A:$I,4,FALSE)","v":{"$error":"#N/A"}},{"$f":"'Исходные данные'!H62","v":"---"},{"$f":"VLOOKUP($J8,Base!$A:$I,5,FALSE)","v":{"$error":"#N/A"}},{"$f":"VLOOKUP($J8,Base!$A:$I,6,FALSE)","v":{"$error":"#N/A"}}]
[{"$error":"#N/A"},{"$error":"#N/A"},{"$error":"#N/A"},"---",{"$error":"#N/A"},{"$error":"#N/A"},null,{"$f":"VLOOKUP($J9,Base!$A:$I,7,FALSE)","v":{"$error":"#N/A"}},{"$f":"VLOOKUP($J9,Base!$A:$I,3,FALSE)","v":{"$error":"#N/A"}},{"$f":"'Исходные данные'!G63","v":0},{"$f":"VLOOKUP($J9,Base!$A:$I,2,FALSE)","v":{"$error":"#N/A"}},"ООО ''ОБО Беттерманн'', г.Липецк",{"$f":"VLOOKUP($J9,Base!$A:$I,4,FALSE)","v":{"$error":"#N/A"}},{"$f":"'Исходные данные'!H63","v":"---"},{"$f":"VLOOKUP($J9,Base!$A:$I,5,FALSE)","v":{"$error":"#N/A"}},{"$f":"VLOOKUP($J9,Base!$A:$I,6,FALSE)","v":{"$error":"#N/A"}}]
[{"$error":"#N/A"},{"$error":"#N/A"},{"$error":"#N/A"},"---",{"$error":"#N/A"},{"$error":"#N/A"},null,{"$f":"VLOOKUP($J10,Base!$A:$I,7,FALSE)","v":{"$error":"#N/A"}},{"$f":"VLOOKUP($J10,Base!$A:$I,3,FALSE)","v":{"$error":"#N/A"}},{"$f":"'Исходные данные'!G64","v":0},{"$f":"VLOOKUP($J10,Base!$A:$I,2,FALSE)","v":{"$error":"#N/A"}},"ООО ''ОБО Беттерманн'', г.Липецк",{"$f":"VLOOKUP($J10,Base!$A:$I,4,FALSE)","v":{"$error":"#N/A"}},{"$f":"'Исходные данные'!H64","v":"---"},{"$f":"VLOOKUP($J10,Base!$A:$I,5,FALSE)","v":{"$error":"#N/A"}},{"$f":"VLOOKUP($J10,Base!$A:$I,6,FALSE)","v":{"$error":"#N/A"}}]
{"$rows_left_out":10}
{"sheet":"Спец. на лист","index":4,"n_rows":300,"n_cols":8,"rows_kept":300,"cut":false,"hidden":false,"merged":[[0,1,0,7],[1,1,1,7]]}
[null,"СПЕЦИФИКАЦИЯ НА ЛИСТ ЧЕРТЕЖА"]
[null,"(по форме 7 ГОСТ Р 21.101-2020)"]
[]
[null,"№ п/п","№","Обозначение","Наименование","Кол-во","Масса","Примечание"]
[null,1]
[null,{"$f":"IF(B5<COUNTA($E$5:$E$2000),B5+1,\"\")","v":""}]
[null,{"$f":"IF(B6<COUNTA($E$5:$E$2000),B6+1,\"\")","v":""}]
[null,""]
[null,""]
[null,""]
{"$rows_left_out":291}
{"sheet":"Спец. обор. изд. и мат.","index":5,"n_rows":300,"n_cols":11,"rows_kept":300,"cut":false,"hidden":false,"merged":[[0,1,0,10],[1,1,1,10]]}
[null,"СПЕЦИФИКАЦИЯ ОБОРУДОВАНИЯ, ИЗДЕЛИЙ И МАТЕРИАЛОВ"]
[null,"(по форме 1 ГОСТ Р 21.110-2013)"]
[]
[null,"№ п/п","№","Наименование","Тип","Артикул","Поставщик","Ед.изм.","Кол-во","Масса","Примечание"]
[null,1]
[null,{"$f":"IF(B5<COUNTA($E$5:$E$2000),B5+1,\"\")","v":""}]
[null,{"$f":"IF(B6<COUNTA($E$5:$E$2000),B6+1,\"\")","v":""}]
[null,""]
[null,""]
[null,""]
{"$rows_left_out":290}